[riscv-reports] [#111176] sisyphus_riscv64 FAILED srpm=zed-0.223.5-alt1.src.rpm

Girar sisyphus_riscv64 awaiter recycler noreply at basealt.ru
Sat Feb 21 00:34:23 MSK 2026


http://web.build.srt.basealt.ru/tasks/111176/logs/events.1.1.log

2026-Feb-20 21:32:31 :: shared task #111176 for sisyphus_riscv64 started by recycler:
2026-Feb-20 21:32:31 :: message: sync
#100 build zed-0.223.5-alt1.src.rpm
2026-Feb-20 21:32:39 :: [riscv64] #100 zed-0.223.5-alt1.src.rpm: build start
2026-Feb-20 21:34:22 :: [riscv64] #100 zed-0.223.5-alt1.src.rpm: build SKIPPED
2026-Feb-20 21:34:23 :: #100: zed-0.223.5-alt1.src.rpm: no source package
2026-Feb-20 21:34:23 :: build check FAILED for: #100 
2026-Feb-20 21:34:23 :: task #111176 for sisyphus_riscv64 FAILED


More information about the Riscv-reports mailing list