[riscv-reports] [#139024] sisyphus_riscv64 FAILED srpm=action-docs-2.5.1-alt1.src.rpm
Girar sisyphus_riscv64 awaiter recycler
noreply at basealt.ru
Mon Aug 31 03:17:41 MSK 2026
http://web.build.srt.basealt.ru/tasks/139024/logs/events.1.1.log
subtask name riscv64
#100 action-docs failed
2026-Aug-31 00:13:45 :: shared task #139024 for sisyphus_riscv64 started by recycler:
2026-Aug-31 00:13:45 :: message: sync
#100 build action-docs-2.5.1-alt1.src.rpm
2026-Aug-31 00:13:58 :: [riscv64] #100 action-docs-2.5.1-alt1.src.rpm: build start
[riscv64] â Test update readme ⺠Readme (all fields) with CRLF line breaks
[riscv64] RangeError: WebAssembly.instantiate(): Out of memory: Cannot allocate Wasm memory for new instance
[riscv64] PASS __tests__/action-docs-workflow.test.ts
2026-Aug-31 00:17:41 :: [riscv64] action-docs-2.5.1-alt1.src.rpm: remote: build failed
2026-Aug-31 00:17:41 :: [riscv64] #100 action-docs-2.5.1-alt1.src.rpm: build FAILED
2026-Aug-31 00:17:41 :: [riscv64] requesting cancellation of task processing
2026-Aug-31 00:17:41 :: [riscv64] build FAILED
2026-Aug-31 00:17:41 :: task #139024 for sisyphus_riscv64 FAILED
More information about the Riscv-reports
mailing list