[riscv-reports] [#138935] sisyphus_riscv64 FAILED srpm=gnome-shell-extension-gnome-runcat-36-alt1.src.rpm
Girar sisyphus_riscv64 awaiter recycler
noreply at basealt.ru
Sat Aug 29 17:09:21 MSK 2026
http://web.build.srt.basealt.ru/tasks/138935/logs/events.1.1.log
subtask name riscv64
#100 gnome-shell-extension-gnome-runcat failed
2026-Aug-29 14:04:54 :: shared task #138935 for sisyphus_riscv64 started by recycler:
2026-Aug-29 14:04:54 :: message: sync
#100 build gnome-shell-extension-gnome-runcat-36-alt1.src.rpm
2026-Aug-29 14:05:00 :: [riscv64] #100 gnome-shell-extension-gnome-runcat-36-alt1.src.rpm: build start
[riscv64] > build
[riscv64] > npm run build:compile && npm run build:prettify
[riscv64] > build:compile
[riscv64] > tsc --project tsconfig.json
[riscv64] sh: line 1: tsc: command not found
[riscv64] make: *** [Makefile:28: .build/extension.js] Error 127
[riscv64] make: Leaving directory '/usr/src/RPM/BUILD/gnome-shell-extension-gnome-runcat-36'
[riscv64] error: Bad exit status from /usr/src/tmp/rpmb-tmp.uC7JI3 (%build)
[riscv64] RPM build errors:
[riscv64] Bad exit status from /usr/src/tmp/rpmb-tmp.uC7JI3 (%build)
2026-Aug-29 14:09:21 :: [riscv64] gnome-shell-extension-gnome-runcat-36-alt1.src.rpm: remote: build failed
2026-Aug-29 14:09:21 :: [riscv64] #100 gnome-shell-extension-gnome-runcat-36-alt1.src.rpm: build FAILED
2026-Aug-29 14:09:21 :: [riscv64] requesting cancellation of task processing
2026-Aug-29 14:09:21 :: [riscv64] build FAILED
2026-Aug-29 14:09:21 :: task #138935 for sisyphus_riscv64 FAILED
More information about the Riscv-reports
mailing list