[riscv-reports] [#138907] sisyphus_riscv64 FAILED srpm=morph-browser-1.99.6-alt1.src.rpm

Girar sisyphus_riscv64 awaiter recycler noreply at basealt.ru
Sat Aug 29 16:16:37 MSK 2026


http://web.build.srt.basealt.ru/tasks/138907/logs/events.1.1.log

2026-Aug-29 13:15:01 :: shared task #138907 for sisyphus_riscv64 started by recycler:
2026-Aug-29 13:15:01 :: message: sync
#100 build morph-browser-1.99.6-alt1.src.rpm
2026-Aug-29 13:15:07 :: [riscv64] #100 morph-browser-1.99.6-alt1.src.rpm: build start
2026-Aug-29 13:16:36 :: [riscv64] #100 morph-browser-1.99.6-alt1.src.rpm: build SKIPPED
2026-Aug-29 13:16:37 :: #100: morph-browser-1.99.6-alt1.src.rpm: no source package
2026-Aug-29 13:16:37 :: build check FAILED for: #100 
2026-Aug-29 13:16:37 :: task #138907 for sisyphus_riscv64 FAILED


More information about the Riscv-reports mailing list