[riscv-reports] [#138869] sisyphus_riscv64 FAILED srpm=python3-module-build-1.6.0-alt1.src.rpm

Girar sisyphus_riscv64 awaiter recycler noreply at basealt.ru
Sat Aug 29 14:36:02 MSK 2026


http://web.build.srt.basealt.ru/tasks/138869/logs/events.1.1.log

subtask  name                  riscv64
   #100  python3-module-build   failed

2026-Aug-29 11:26:51 :: shared task #138869 for sisyphus_riscv64 started by recycler:
2026-Aug-29 11:26:51 :: message: sync
#100 build python3-module-build-1.6.0-alt1.src.rpm
2026-Aug-29 11:27:00 :: [riscv64] #100 python3-module-build-1.6.0-alt1.src.rpm: build start
[riscv64] >           assert env._env_backend.display_name == env_backend_display_name
[riscv64] E           AssertionError: assert 'venv+pip' == 'virtualenv+pip'
[riscv64] E             
[riscv64] --
[riscv64] SKIPPED [1] tests/test_integration.py: integration tests not run (no --run-integration flag)
[riscv64] FAILED tests/test_env.py::test_venv_creation[pip-virtualenv+pip-None] - Asser...
[riscv64] ===== 1 failed, 285 passed, 3 skipped, 62 deselected in 358.07s (0:05:58) ======
[riscv64] INFO     : Command's result: FAILURE
[riscv64] INFO     : Command's error: Command '['python3', '-m', 'pytest', '-vra', '-m', 'not network']' returned non-zero exit status 1.
[riscv64] error: Bad exit status from /usr/src/tmp/rpmb-tmp.Cj3r8t (%check)
2026-Aug-29 11:36:01 :: [riscv64] python3-module-build-1.6.0-alt1.src.rpm: remote: build failed
2026-Aug-29 11:36:01 :: [riscv64] #100 python3-module-build-1.6.0-alt1.src.rpm: build FAILED
2026-Aug-29 11:36:01 :: [riscv64] requesting cancellation of task processing
2026-Aug-29 11:36:02 :: [riscv64] build FAILED
2026-Aug-29 11:36:02 :: task #138869 for sisyphus_riscv64 FAILED


More information about the Riscv-reports mailing list