[riscv-reports] [#138753] sisyphus_riscv64 FAILED srpm=python3-module-zmqtt-0.2.0-alt1.src.rpm ...

Girar sisyphus_riscv64 awaiter recycler noreply at basealt.ru
Fri Aug 28 13:02:40 MSK 2026


http://web.build.srt.basealt.ru/tasks/138753/logs/events.1.1.log

subtask  name                       riscv64
   #100  python3-module-zmqtt          4:24
   #200  python3-module-faststream   failed

2026-Aug-28 09:48:25 :: shared task #138753 for sisyphus_riscv64 started by recycler:
2026-Aug-28 09:48:25 :: message: sync
#100 build python3-module-zmqtt-0.2.0-alt1.src.rpm
#200 build python3-module-faststream-0.7.5-alt1.src.rpm
2026-Aug-28 09:48:25 :: created build repo
2026-Aug-28 09:48:31 :: [riscv64] #100 python3-module-zmqtt-0.2.0-alt1.src.rpm: build start
2026-Aug-28 09:52:55 :: [riscv64] #100 python3-module-zmqtt-0.2.0-alt1.src.rpm: build OK
2026-Aug-28 09:52:55 :: [riscv64] #200 python3-module-faststream-0.7.5-alt1.src.rpm: build start
[riscv64] >           raise mapped_exc(message) from exc
[riscv64] E           httpx.ConnectError: [Errno 111] Connection refused
[riscv64] /usr/lib/python3/site-packages/httpx/_transports/default.py:118: ConnectError
[riscv64] --
[riscv64] =========================== short test summary info ============================
[riscv64] FAILED tests/cli/test_asyncapi_docs.py::test_serve_asyncapi_docs_from_app_with_reload
[riscv64] FAILED tests/cli/test_run.py::test_run - AssertionError: assert -2 == 0
[riscv64] FAILED tests/cli/test_run_asgi.py::test_run - httpx.ConnectError: [Errno 111]...
[riscv64] FAILED tests/cli/test_run_asgi.py::test_single_worker - httpx.ConnectError: [...
[riscv64] FAILED tests/cli/test_run_asgi.py::test_many_workers - AssertionError: assert...
[riscv64] FAILED tests/cli/test_run_asgi.py::test_factory - httpx.ConnectError: [Errno ...
[riscv64] = 6 failed, 4019 passed, 53 skipped, 2311 deselected, 7 xfailed, 471 warnings, 12 rerun in 310.42s (0:05:10) =
[riscv64] INFO     : Command's result: FAILURE
[riscv64] INFO     : Command's error: Command '['python3', '-m', 'pytest', '-vv', '-m', '(slow and not connected) or not connected']' returned non-zero exit status 1.
[riscv64] error: Bad exit status from /usr/src/tmp/rpmb-tmp.Vybtwp (%check)
2026-Aug-28 10:02:39 :: [riscv64] python3-module-faststream-0.7.5-alt1.src.rpm: remote: build failed
2026-Aug-28 10:02:39 :: [riscv64] #200 python3-module-faststream-0.7.5-alt1.src.rpm: build FAILED
2026-Aug-28 10:02:39 :: [riscv64] requesting cancellation of task processing
2026-Aug-28 10:02:40 :: [riscv64] build FAILED
2026-Aug-28 10:02:40 :: task #138753 for sisyphus_riscv64 FAILED


More information about the Riscv-reports mailing list