[riscv-reports] [#138736] sisyphus_riscv64 FAILED srpm=python3-module-py-cpuinfo2-10.1.1-alt1.src.rpm ...
Girar sisyphus_riscv64 awaiter recycler
noreply at basealt.ru
Fri Aug 28 11:24:25 MSK 2026
http://web.build.srt.basealt.ru/tasks/138736/logs/events.1.1.log
subtask name riscv64
#100 python3-module-py-cpuinfo2 failed
2026-Aug-28 08:20:46 :: shared task #138736 for sisyphus_riscv64 started by recycler:
2026-Aug-28 08:20:46 :: message: sync
#100 build python3-module-py-cpuinfo2-10.1.1-alt1.src.rpm
#200 build python3-module-pytest-benchmark-5.3.0-alt1.src.rpm
#300 build python3-module-cpuinfo-9.0.0-alt3.src.rpm
2026-Aug-28 08:20:46 :: created build repo
2026-Aug-28 08:20:54 :: [riscv64] #100 python3-module-py-cpuinfo2-10.1.1-alt1.src.rpm: build start
[riscv64] SKIPPED [1] tests/test_linux_aarch64_64.py:143: FIXME: This fails because it does not have a way to get CPU brand string and Hz.
[riscv64] FAILED tests/test_actual.py::test_all - assert 0 > 0
[riscv64] =================== 1 failed, 163 passed, 2 skipped in 6.86s ===================
[riscv64] INFO : Command's result: FAILURE
[riscv64] INFO : Command's error: Command '['python3', '-m', 'pytest', '-vra']' returned non-zero exit status 1.
[riscv64] error: Bad exit status from /usr/src/tmp/rpmb-tmp.P8Gjme (%check)
2026-Aug-28 08:24:24 :: [riscv64] python3-module-py-cpuinfo2-10.1.1-alt1.src.rpm: remote: build failed
2026-Aug-28 08:24:25 :: [riscv64] #100 python3-module-py-cpuinfo2-10.1.1-alt1.src.rpm: build FAILED
2026-Aug-28 08:24:25 :: [riscv64] requesting cancellation of task processing
2026-Aug-28 08:24:25 :: [riscv64] build FAILED
2026-Aug-28 08:24:25 :: task #138736 for sisyphus_riscv64 FAILED
More information about the Riscv-reports
mailing list