[riscv-reports] [#138725] sisyphus_riscv64 FAILED srpm=zed-1.17.2-alt1.src.rpm

Girar sisyphus_riscv64 awaiter recycler noreply at basealt.ru
Fri Aug 28 10:08:08 MSK 2026


http://web.build.srt.basealt.ru/tasks/138725/logs/events.1.1.log

2026-Aug-28 07:06:01 :: shared task #138725 for sisyphus_riscv64 started by recycler:
2026-Aug-28 07:06:01 :: message: sync
#100 build zed-1.17.2-alt1.src.rpm
2026-Aug-28 07:06:07 :: [riscv64] #100 zed-1.17.2-alt1.src.rpm: build start
2026-Aug-28 07:08:06 :: [riscv64] #100 zed-1.17.2-alt1.src.rpm: build SKIPPED
2026-Aug-28 07:08:08 :: #100: zed-1.17.2-alt1.src.rpm: no source package
2026-Aug-28 07:08:08 :: build check FAILED for: #100 
2026-Aug-28 07:08:08 :: task #138725 for sisyphus_riscv64 FAILED


More information about the Riscv-reports mailing list