[riscv-reports] [#138241] [test-only] sisyphus_riscv64 FAILED srpm=java-25-openjdk-25.0.4.1.1-alt1.src.rpm
Girar sisyphus_riscv64 awaiter iv
noreply at basealt.ru
Mon Aug 24 13:55:33 MSK 2026
http://web.build.srt.basealt.ru/tasks/138241/logs/events.1.1.log
subtask name riscv64
#100 java-25-openjdk failed
2026-Aug-24 10:53:46 :: test-only shared task #138241 for sisyphus_riscv64 started by iv:
#100 build java-25-openjdk-25.0.4.1.1-alt1.src.rpm
2026-Aug-24 10:53:53 :: [riscv64] #100 java-25-openjdk-25.0.4.1.1-alt1.src.rpm: build start
[riscv64] warning: user cas does not exist - using root
[riscv64] warning: group cas does not exist - using root
[riscv64] warning: user cas does not exist - using root
[riscv64] warning: group cas does not exist - using root
[riscv64] warning: user cas does not exist - using root
[riscv64] warning: group cas does not exist - using root
[riscv64] warning: user cas does not exist - using root
[riscv64] warning: group cas does not exist - using root
[riscv64] warning: user cas does not exist - using root
[riscv64] warning: group cas does not exist - using root
[riscv64] warning: user cas does not exist - using root
[riscv64] warning: group cas does not exist - using root
[riscv64] warning: user cas does not exist - using root
[riscv64] warning: group cas does not exist - using root
[riscv64] warning: user cas does not exist - using root
[riscv64] warning: group cas does not exist - using root
[riscv64] warning: user cas does not exist - using root
[riscv64] warning: group cas does not exist - using root
[riscv64] warning: user cas does not exist - using root
[riscv64] warning: group cas does not exist - using root
[riscv64] <13>Aug 24 10:55:22 rpmi: libgdbm6-1.26-alt1 sisyphus_riscv64+126243.100.1.1 1779345791 installed
[riscv64] <13>Aug 24 10:55:22 rpmi: libgdbm_compat4-1.26-alt1 sisyphus_riscv64+126243.100.1.1 1779345791 installed
[riscv64] <13>Aug 24 10:55:22 rpmi: rpm-macros-java-1:6.4.1-alt3 sisyphus_riscv64+130095.200.1.1 1782386900 installed
[riscv64] <13>Aug 24 10:55:22 rpmi: libxml2-1:2.12.10-alt3 sisyphus_riscv64+106871.100.1.1 1768511693 installed
[riscv64] <13>Aug 24 10:55:22 rpmi: libxslt-1.1.43-alt1 sisyphus_riscv64+98697.100.1.1 1761621654 installed
[riscv64] <13>Aug 24 10:55:22 rpmi: libsqlite3-3.53.3-alt1 sisyphus_riscv64+136692.100.2.1 1786511043 installed
[riscv64] <13>Aug 24 10:55:22 rpmi: libmpdec3-2.5.1-alt3 sisyphus_riscv64+29035.100.1.1 1675621702 installed
[riscv64] <13>Aug 24 10:55:22 rpmi: libexpat-2.7.4-alt1 sisyphus_riscv64+109313.100.1.1 1770323898 installed
[riscv64] <13>Aug 24 10:55:22 rpmi: openssl-config-3.5.0-alt1 sisyphus_riscv64+99925.100.1.1 1762587030 installed
[riscv64] <13>Aug 24 10:55:22 rpmi: jurand-1.3.5-alt2 sisyphus_riscv64+76163.100.1.1 1741953691 installed
[riscv64] <13>Aug 24 10:55:22 rpmi: rpm-macros-jurand-1.3.5-alt2 sisyphus_riscv64+76163.100.1.1 1741953691 installed
[riscv64] <13>Aug 24 10:55:22 rpmi: javapackages-filesystem-1:6.4.1-alt3 sisyphus_riscv64+130095.200.1.1 1782386900 installed
[riscv64] <13>Aug 24 10:55:22 rpmi: javapackages-tools-1:6.4.1-alt3 sisyphus_riscv64+130095.200.1.1 1782386900 installed
[riscv64] <13>Aug 24 10:55:22 rpmi: libp11-kit-1:0.26.5-alt1 sisyphus_riscv64+136901.100.1.1 1786563447 installed
[riscv64] <13>Aug 24 10:55:22 rpmi: libtasn1-4.21.0-alt2 sisyphus_riscv64+128673.100.1.1 1781194651 installed
[riscv64] <13>Aug 24 10:55:22 rpmi: rpm-macros-alternatives-0.5.3-alt1 sisyphus_riscv64+71244.100.1.1 1738025117 installed
[riscv64] <13>Aug 24 10:55:22 rpmi: alternatives-0.5.3-alt1 sisyphus_riscv64+71244.100.1.1 1738025117 installed
[riscv64] <13>Aug 24 10:55:22 rpmi: ca-certificates-2026.04.22-alt1 sisyphus_riscv64+124784.100.1.1 1778294417 installed
[riscv64] <13>Aug 24 10:55:22 rpmi: ca-trust-0.2.0-alt1 sisyphus_riscv64+47419.100.1.1 1712764300 installed
[riscv64] <13>Aug 24 10:55:22 rpmi: p11-kit-trust-1:0.26.5-alt1 sisyphus_riscv64+136901.100.1.1 1786563447 installed
[riscv64] <13>Aug 24 10:55:22 rpmi: libcrypto3-3.5.7-alt1 sisyphus_riscv64+133681.100.1.1 1785499930 installed
[riscv64] <13>Aug 24 10:55:22 rpmi: libssl3-3.5.7-alt1 sisyphus_riscv64+133681.100.1.1 1785499930 installed
[riscv64] <13>Aug 24 10:55:22 rpmi: python3-modules-sqlite3-3.14.7-alt1 sisyphus_riscv64+136705.100.1.2 1786521315 installed
[riscv64] <13>Aug 24 10:55:23 rpmi: python3-3.14.7-alt1 sisyphus_riscv64+136705.100.1.2 1786521315 installed
[riscv64] <13>Aug 24 10:55:25 rpmi: python3-base-3.14.7-alt1 sisyphus_riscv64+136705.100.1.2 1786521315 installed
[riscv64] <13>Aug 24 10:55:25 rpmi: python3-module-cssselect-1.4.0-alt1.1 sisyphus_riscv64+116970.200.1.1 1774891857 installed
[riscv64] <13>Aug 24 10:55:25 rpmi: python3-module-genshi-0.7.10-alt1 sisyphus_riscv64+135987.14500.1.1 1786254481 installed
[riscv64] <13>Aug 24 10:55:25 rpmi: python3-module-six-1.17.0-alt1.1 sisyphus_riscv64+72388.100.1.1 1738957031 installed
[riscv64] <13>Aug 24 10:55:25 rpmi: python3-module-webencodings-0.5.1-alt3 sisyphus_riscv64+54276.100.1.1 1728411577 installed
[riscv64] <13>Aug 24 10:55:26 rpmi: python3-module-lxml-6.0.2-alt3 sisyphus_riscv64+133706.100.1.1 1785507410 installed
[riscv64] <13>Aug 24 10:55:26 rpmi: python3-module-html5lib-1:1.1-alt1 sisyphus_riscv64+9885.100.2.1 1635066927 installed
[riscv64] <13>Aug 24 10:55:26 rpmi: python3-module-javapackages-1:6.4.1-alt3 sisyphus_riscv64+130095.200.1.1 1782386900 installed
[riscv64] <13>Aug 24 10:55:26 rpmi: rpm-build-java-1:6.4.1-alt3 sisyphus_riscv64+130095.200.1.1 1782386900 installed
[riscv64] Reading Package Lists...
[riscv64] Building Dependency Tree...
[riscv64] MI2a: marked for install (shallow): libalsa-devel
[riscv64] MI2a: satisfying Depends: libalsa = 1:1.2.15.3-alt1:sisyphus_riscv64+129200.200.1.1
[riscv64] MI2a: maybe install (a direct target): libalsa 1:1.2.15.3-alt1:sisyphus_riscv64+129200.200.1.1 at 1781635607
[riscv64] MI2a: target SELECTED: libalsa 1:1.2.15.3-alt1:sisyphus_riscv64+129200.200.1.1 at 1781635607
[riscv64] MI2a: requesting to install libalsa (unspec'd ver; inspect with Debug::pkgMark-shallow)
[riscv64] MI2a: marked for install (shallow): libalsa
[riscv64] MI2a: satisfying Depends: alsa-ucm-conf (NULL)
[riscv64] MI2a: maybe install (a direct target): alsa-ucm-conf 1.2.15.3-alt1:sisyphus_riscv64+129200.400.1.1 at 1781636132
[riscv64] MI2a: target SELECTED: alsa-ucm-conf 1.2.15.3-alt1:sisyphus_riscv64+129200.400.1.1 at 1781636132
[riscv64] MI2a: requesting to install alsa-ucm-conf (unspec'd ver; inspect with Debug::pkgMark-shallow)
[riscv64] MI2a: marked for install (shallow): alsa-ucm-conf
[riscv64] MI2a: satisfying Depends: alsa-topology-conf (NULL)
[riscv64] MI2a: maybe install (a direct target): alsa-topology-conf 1.2.5.1-alt1:sisyphus_riscv64+9152.100.1.1 at 1633924338
[riscv64] MI2a: target SELECTED: alsa-topology-conf 1.2.5.1-alt1:sisyphus_riscv64+9152.100.1.1 at 1633924338
[riscv64] MI2a: requesting to install alsa-topology-conf (unspec'd ver; inspect with Debug::pkgMark-shallow)
[riscv64] MI2a: marked for install (shallow): alsa-topology-conf
[riscv64] MI2a: marked for install (shallow): libcups-devel
[riscv64] MI2a: satisfying Depends: libcups = 2.4.19-alt1:sisyphus_riscv64+120975.100.1.1
[riscv64] MI2a: maybe install (a direct target): libcups 2.4.19-alt1:sisyphus_riscv64+120975.100.1.1 at 1778304351
[riscv64] MI2a: target SELECTED: libcups 2.4.19-alt1:sisyphus_riscv64+120975.100.1.1 at 1778304351
[riscv64] MI2a: requesting to install libcups (unspec'd ver; inspect with Debug::pkgMark-shallow)
[riscv64] MI2a: marked for install (shallow): libcups
[riscv64] MI2a: satisfying Depends: libavahi-client.so.3()(64bit) >= set:jfA3BZHwMrmi1ycn68JmS1
[riscv64] MI2a: maybe install (a providing target): libavahi 0.8-alt5:sisyphus_riscv64+126243.300.1.2 at 1779359234
[riscv64] MI2a: target SELECTED: libavahi 0.8-alt5:sisyphus_riscv64+126243.300.1.2 at 1779359234
[riscv64] MI2a: requesting to install libavahi (unspec'd ver; inspect with Debug::pkgMark-shallow)
[riscv64] MI2a: marked for install (shallow): libavahi
[riscv64] MI2a: satisfying Depends: libdbus-1.so.3()(64bit) >= set:nh6lX7Ch1wT2tnoGAavkoLIaOMlFPWDh2IEzDczREsNGvcJ2BIMVtJOyc4lBdf4zY4GjRLnRfkz1gIEZ8jmTn6D8DxpXZEi5nIzL0GgM7BgUUTXmsBYUJYVMhiaqZ3t2
[riscv64] MI2a: maybe install (a providing target): libdbus 1.16.2-alt1:sisyphus_riscv64+74775.100.1.1 at 1740875412
[riscv64] MI2a: target SELECTED: libdbus 1.16.2-alt1:sisyphus_riscv64+74775.100.1.1 at 1740875412
[riscv64] MI2a: requesting to install libdbus (unspec'd ver; inspect with Debug::pkgMark-shallow)
[riscv64] MI2a: marked for install (shallow): libdbus
[riscv64] MI2a: satisfying Depends: libsystemd.so.0()(64bit) >= set:nlK0Q6n66
[riscv64] MI2a: maybe install (a providing target): libsystemd 1:258.9-alt1:sisyphus_riscv64+132172.100.1.1 at 1783616614
[riscv64] MI2a: target SELECTED: libsystemd 1:258.9-alt1:sisyphus_riscv64+132172.100.1.1 at 1783616614
[riscv64] MI2a: requesting to install libsystemd (unspec'd ver; inspect with Debug::pkgMark-shallow)
[riscv64] MI2a: marked for install (shallow): libsystemd
[riscv64] MI2a: satisfying Depends: libgssapi_krb5.so.2()(64bit) >= set:liDJYcUWfOEnzLagJba
[riscv64] MI2a: maybe install (a providing target): libkrb5 1.22.2-alt2:sisyphus_riscv64+133807.100.1.1 at 1785580061
[riscv64] MI2a: target SELECTED: libkrb5 1.22.2-alt2:sisyphus_riscv64+133807.100.1.1 at 1785580061
[riscv64] MI2a: requesting to install libkrb5 (unspec'd ver; inspect with Debug::pkgMark-shallow)
[riscv64] MI2a: marked for install (shallow): libkrb5
[riscv64] MI2a: satisfying Depends: libcom_err.so.2()(64bit) >= set:ifPl8xIvqGQAmqI1
[riscv64] MI2a: maybe install (a providing target): libcom_err 1.47.4.0.2.a9f48-alt1:sisyphus_riscv64+121015.100.1.1 at 1778308586
[riscv64] MI2a: target SELECTED: libcom_err 1.47.4.0.2.a9f48-alt1:sisyphus_riscv64+121015.100.1.1 at 1778308586
[riscv64] MI2a: requesting to install libcom_err (unspec'd ver; inspect with Debug::pkgMark-shallow)
[riscv64] MI2a: marked for install (shallow): libcom_err
[riscv64] MI2a: satisfying Depends: libkeyutils.so.1()(64bit) >= set:jfWn12U6KThBXgruPLZ68yYZt2
[riscv64] MI2a: maybe install (a providing target): libkeyutils 1.6.3-alt1:sisyphus_riscv64+49335.100.1.1 at 1716592270
[riscv64] MI2a: target SELECTED: libkeyutils 1.6.3-alt1:sisyphus_riscv64+49335.100.1.1 at 1716592270
[riscv64] MI2a: requesting to install libkeyutils (unspec'd ver; inspect with Debug::pkgMark-shallow)
[riscv64] MI2a: marked for install (shallow): libkeyutils
[riscv64] MI2a: satisfying Depends: liblmdb.so.0()(64bit) >= set:kfalKd4xYAkaAG2MqeH0wB2F4kTaBEo1iv0KFpxVmqzFIV6HJ0
[riscv64] MI2a: maybe install (a providing target): liblmdb 0.9.35-alt1:sisyphus_riscv64+111449.100.1.1 at 1771669538
[riscv64] MI2a: target SELECTED: liblmdb 0.9.35-alt1:sisyphus_riscv64+111449.100.1.1 at 1771669538
[riscv64] MI2a: requesting to install liblmdb (unspec'd ver; inspect with Debug::pkgMark-shallow)
[riscv64] MI2a: marked for install (shallow): liblmdb
[riscv64] MI2a: satisfying Depends: libverto.so.1()(64bit) >= set:jfI5MRvI6tmNn0zwQdb68Gk0
[riscv64] MI2a: maybe install (a providing target): libverto 0.3.2-alt1_1:sisyphus_riscv64+33133.1200.2.1 at 1684932150
[riscv64] MI2a: target SELECTED: libverto 0.3.2-alt1_1:sisyphus_riscv64+33133.1200.2.1 at 1684932150
[riscv64] MI2a: requesting to install libverto (unspec'd ver; inspect with Debug::pkgMark-shallow)
[riscv64] MI2a: marked for install (shallow): libverto
[riscv64] MI2a: marked for install (shallow): libasm-devel
[riscv64] MI2a: satisfying Depends: libdw-devel = 0.191-alt1:sisyphus_riscv64+48303.100.1.1
[riscv64] MI2a: maybe install (a direct target): libdw-devel 0.191-alt1:sisyphus_riscv64+48303.100.1.1 at 1714905779
[riscv64] MI2a: target SELECTED: libdw-devel 0.191-alt1:sisyphus_riscv64+48303.100.1.1 at 1714905779
[riscv64] MI2a: requesting to install libdw-devel (unspec'd ver; inspect with Debug::pkgMark-shallow)
[riscv64] MI2a: marked for install (shallow): libdw-devel
[riscv64] MI2a: satisfying Depends: libelf-devel = 0.191-alt1:sisyphus_riscv64+48303.100.1.1
[riscv64] MI2a: maybe install (a direct target): libelf-devel 0.191-alt1:sisyphus_riscv64+48303.100.1.1 at 1714905779
[riscv64] MI2a: target SELECTED: libelf-devel 0.191-alt1:sisyphus_riscv64+48303.100.1.1 at 1714905779
[riscv64] MI2a: requesting to install libelf-devel (unspec'd ver; inspect with Debug::pkgMark-shallow)
[riscv64] MI2a: marked for install (shallow): libelf-devel
[riscv64] MI2a: marked for install (shallow): fontconfig-devel
[riscv64] MI2a: satisfying Depends: libfreetype-devel (NULL)
[riscv64] MI2a: maybe install (a direct target): libfreetype-devel 2.14.3-alt1:sisyphus_riscv64+116242.100.1.1 at 1774475273
[riscv64] MI2a: target SELECTED: libfreetype-devel 2.14.3-alt1:sisyphus_riscv64+116242.100.1.1 at 1774475273
[riscv64] MI2a: requesting to install libfreetype-devel (unspec'd ver; inspect with Debug::pkgMark-shallow)
[riscv64] MI2a: marked for install (shallow): libfreetype-devel
[riscv64] MI2a: satisfying Depends: libharfbuzz-devel (NULL)
[riscv64] MI2a: maybe install (a direct target): libharfbuzz-devel 14.2.1-alt1:sisyphus_riscv64+134745.300.1.1 at 1785869978
[riscv64] MI2a: target SELECTED: libharfbuzz-devel 14.2.1-alt1:sisyphus_riscv64+134745.300.1.1 at 1785869978
[riscv64] MI2a: requesting to install libharfbuzz-devel (unspec'd ver; inspect with Debug::pkgMark-shallow)
[riscv64] MI2a: marked for install (shallow): libharfbuzz-devel
[riscv64] MI2a: satisfying Depends: glib2-devel (NULL)
[riscv64] MI2a: maybe install (a direct target): glib2-devel 2.88.3-alt1:sisyphus_riscv64+135146.100.1.2 at 1786068855
[riscv64] MI2a: target SELECTED: glib2-devel 2.88.3-alt1:sisyphus_riscv64+135146.100.1.2 at 1786068855
[riscv64] MI2a: requesting to install glib2-devel (unspec'd ver; inspect with Debug::pkgMark-shallow)
[riscv64] MI2a: marked for install (shallow): glib2-devel
[riscv64] MI2a: satisfying Depends: rpm-build-gir >= 0.5
[riscv64] MI2a: maybe install (a direct target): rpm-build-gir 0.7.3-alt3.1:sisyphus_riscv64+32169.100.1.1 at 1683014292
[riscv64] MI2a: target SELECTED: rpm-build-gir 0.7.3-alt3.1:sisyphus_riscv64+32169.100.1.1 at 1683014292
[riscv64] MI2a: requesting to install rpm-build-gir (unspec'd ver; inspect with Debug::pkgMark-shallow)
[riscv64] MI2a: marked for install (shallow): rpm-build-gir
[riscv64] MI2a: satisfying Depends: xml-utils (NULL)
[riscv64] MI2a: maybe install (a direct target): xml-utils 1:2.14.6-alt4:sisyphus_riscv64+135987.7000.1.1 at 1786234967
[riscv64] MI2a: target SELECTED: xml-utils 1:2.14.6-alt4:sisyphus_riscv64+135987.7000.1.1 at 1786234967
[riscv64] MI2a: requesting to install xml-utils (unspec'd ver; inspect with Debug::pkgMark-shallow)
[riscv64] MI2a: marked for install (shallow): xml-utils
[riscv64] MI2a: satisfying Depends: xml-common (NULL)
[riscv64] MI2a: maybe install (a direct target): xml-common 0.6.3-alt15:sisyphus_riscv64+8304.100.1.1 at 1632333716
[riscv64] MI2a: target SELECTED: xml-common 0.6.3-alt15:sisyphus_riscv64+8304.100.1.1 at 1632333716
[riscv64] MI2a: requesting to install xml-common (unspec'd ver; inspect with Debug::pkgMark-shallow)
[riscv64] MI2a: marked for install (shallow): xml-common
[riscv64] MI2a: satisfying Depends: libgio = 2.88.3-alt1:sisyphus_riscv64+135146.100.1.2
[riscv64] MI2a: maybe install (a direct target): libgio 2.88.3-alt1:sisyphus_riscv64+135146.100.1.2 at 1786068855
[riscv64] MI2a: target SELECTED: libgio 2.88.3-alt1:sisyphus_riscv64+135146.100.1.2 at 1786068855
[riscv64] MI2a: requesting to install libgio (unspec'd ver; inspect with Debug::pkgMark-shallow)
[riscv64] MI2a: marked for install (shallow): libgio
[riscv64] MI2a: satisfying Depends: gsettings-desktop-schemas (NULL)
[riscv64] MI2a: maybe install (a direct target): gsettings-desktop-schemas 50.1-alt1:sisyphus_riscv64+119263.100.1.1 at 1776369800
[riscv64] MI2a: target SELECTED: gsettings-desktop-schemas 50.1-alt1:sisyphus_riscv64+119263.100.1.1 at 1776369800
[riscv64] MI2a: requesting to install gsettings-desktop-schemas (unspec'd ver; inspect with Debug::pkgMark-shallow)
[riscv64] MI2a: marked for install (shallow): gsettings-desktop-schemas
[riscv64] MI2a: satisfying Depends: gsettings-desktop-schemas-data = 50.1-alt1:sisyphus_riscv64+119263.100.1.1
[riscv64] MI2a: maybe install (a direct target): gsettings-desktop-schemas-data 50.1-alt1:sisyphus_riscv64+119263.100.1.1 at 1776369800
[riscv64] MI2a: target SELECTED: gsettings-desktop-schemas-data 50.1-alt1:sisyphus_riscv64+119263.100.1.1 at 1776369800
[riscv64] MI2a: requesting to install gsettings-desktop-schemas-data (unspec'd ver; inspect with Debug::pkgMark-shallow)
[riscv64] MI2a: marked for install (shallow): gsettings-desktop-schemas-data
[riscv64] MI2a: satisfying Depends: shared-mime-info >= 0.80
[riscv64] MI2a: maybe install (a direct target): shared-mime-info 2.5.1-alt1:sisyphus_riscv64+130865.100.1.1 at 1782801104
[riscv64] MI2a: target SELECTED: shared-mime-info 2.5.1-alt1:sisyphus_riscv64+130865.100.1.1 at 1782801104
[riscv64] MI2a: requesting to install shared-mime-info (unspec'd ver; inspect with Debug::pkgMark-shallow)
[riscv64] MI2a: marked for install (shallow): shared-mime-info
[riscv64] MI2a: satisfying Depends: libcairo-devel (NULL)
[riscv64] MI2a: maybe install (a direct target): libcairo-devel 1:1.18.4-alt1:sisyphus_riscv64+75640.100.1.1 at 1741606770
[riscv64] MI2a: target SELECTED: libcairo-devel 1:1.18.4-alt1:sisyphus_riscv64+75640.100.1.1 at 1741606770
[riscv64] MI2a: requesting to install libcairo-devel (unspec'd ver; inspect with Debug::pkgMark-shallow)
[riscv64] MI2a: marked for install (shallow): libcairo-devel
[riscv64] MI2a: satisfying Depends: libX11-devel (NULL)
[riscv64] MI2a: maybe install (a direct target): libX11-devel 3:1.8.13-alt1:sisyphus_riscv64+110010.100.1.1 at 1770694923
[riscv64] MI2a: target SELECTED: libX11-devel 3:1.8.13-alt1:sisyphus_riscv64+110010.100.1.1 at 1770694923
[riscv64] MI2a: requesting to install libX11-devel (unspec'd ver; inspect with Debug::pkgMark-shallow)
[riscv64] MI2a: marked for install (shallow): libX11-devel
[riscv64] MI2a: satisfying Depends: libxcb-devel (NULL)
[riscv64] MI2a: maybe install (a direct target): libxcb-devel 1.17.0-alt1:sisyphus_riscv64+47651.200.1.1 at 1713376021
[riscv64] MI2a: target SELECTED: libxcb-devel 1.17.0-alt1:sisyphus_riscv64+47651.200.1.1 at 1713376021
[riscv64] MI2a: requesting to install libxcb-devel (unspec'd ver; inspect with Debug::pkgMark-shallow)
[riscv64] MI2a: marked for install (shallow): libxcb-devel
[riscv64] MI2a: satisfying Depends: libxcb = 1.17.0-alt1:sisyphus_riscv64+47651.200.1.1
[riscv64] MI2a: maybe install (a direct target): libxcb 1.17.0-alt1:sisyphus_riscv64+47651.200.1.1 at 1713376021
[riscv64] MI2a: target SELECTED: libxcb 1.17.0-alt1:sisyphus_riscv64+47651.200.1.1 at 1713376021
[riscv64] MI2a: requesting to install libxcb (unspec'd ver; inspect with Debug::pkgMark-shallow)
[riscv64] MI2a: marked for install (shallow): libxcb
[riscv64] MI2a: satisfying Depends: libXau.so.6()(64bit) >= set:ge34k81
[riscv64] MI2a: maybe install (a providing target): libXau 1.0.11-alt1:sisyphus_riscv64+26806.100.1.1 at 1670595777
[riscv64] MI2a: target SELECTED: libXau 1.0.11-alt1:sisyphus_riscv64+26806.100.1.1 at 1670595777
[riscv64] MI2a: requesting to install libXau (unspec'd ver; inspect with Debug::pkgMark-shallow)
[riscv64] MI2a: marked for install (shallow): libXau
[riscv64] MI2a: satisfying Depends: libXdmcp.so.6()(64bit) >= set:jiOzo
[riscv64] MI2a: maybe install (a providing target): libXdmcp 1.1.5-alt1:sisyphus_riscv64+46670.1000.1.1 at 1711473415
[riscv64] MI2a: target SELECTED: libXdmcp 1.1.5-alt1:sisyphus_riscv64+46670.1000.1.1 at 1711473415
[riscv64] MI2a: requesting to install libXdmcp (unspec'd ver; inspect with Debug::pkgMark-shallow)
[riscv64] MI2a: marked for install (shallow): libXdmcp
[riscv64] MI2a: satisfying Depends: pkgconfig(kbproto) (NULL)
[riscv64] MI2a: maybe install (a providing target): xorg-proto-devel 2025.1-alt1:sisyphus_riscv64+107259.100.1.1 at 1768840357
[riscv64] MI2a: target SELECTED: xorg-proto-devel 2025.1-alt1:sisyphus_riscv64+107259.100.1.1 at 1768840357
[riscv64] MI2a: requesting to install xorg-proto-devel (unspec'd ver; inspect with Debug::pkgMark-shallow)
[riscv64] MI2a: marked for install (shallow): xorg-proto-devel
[riscv64] MI2a: satisfying Depends: libX11 = 3:1.8.13-alt1:sisyphus_riscv64+110010.100.1.1
[riscv64] MI2a: maybe install (a direct target): libX11 3:1.8.13-alt1:sisyphus_riscv64+110010.100.1.1 at 1770694923
[riscv64] MI2a: target SELECTED: libX11 3:1.8.13-alt1:sisyphus_riscv64+110010.100.1.1 at 1770694923
[riscv64] MI2a: requesting to install libX11 (unspec'd ver; inspect with Debug::pkgMark-shallow)
[riscv64] MI2a: marked for install (shallow): libX11
[riscv64] MI2a: satisfying Depends: libX11-locales = 3:1.8.13-alt1:sisyphus_riscv64+110010.100.1.1
[riscv64] MI2a: maybe install (a direct target): libX11-locales 3:1.8.13-alt1:sisyphus_riscv64+110010.100.1.1 at 1770694923
[riscv64] MI2a: target SELECTED: libX11-locales 3:1.8.13-alt1:sisyphus_riscv64+110010.100.1.1 at 1770694923
[riscv64] MI2a: requesting to install libX11-locales (unspec'd ver; inspect with Debug::pkgMark-shallow)
[riscv64] MI2a: marked for install (shallow): libX11-locales
[riscv64] MI2a: satisfying Depends: libXrender-devel (NULL)
[riscv64] MI2a: maybe install (a direct target): libXrender-devel 0.9.12-alt1:sisyphus_riscv64+71951.100.1.1 at 1738665677
[riscv64] MI2a: target SELECTED: libXrender-devel 0.9.12-alt1:sisyphus_riscv64+71951.100.1.1 at 1738665677
[riscv64] MI2a: requesting to install libXrender-devel (unspec'd ver; inspect with Debug::pkgMark-shallow)
[riscv64] MI2a: marked for install (shallow): libXrender-devel
[riscv64] MI2a: satisfying Depends: libXrender = 0.9.12-alt1:sisyphus_riscv64+71951.100.1.1
[riscv64] MI2a: maybe install (a direct target): libXrender 0.9.12-alt1:sisyphus_riscv64+71951.100.1.1 at 1738665677
[riscv64] MI2a: target SELECTED: libXrender 0.9.12-alt1:sisyphus_riscv64+71951.100.1.1 at 1738665677
[riscv64] MI2a: requesting to install libXrender (unspec'd ver; inspect with Debug::pkgMark-shallow)
[riscv64] MI2a: marked for install (shallow): libXrender
[riscv64] MI2a: satisfying Depends: pkgconfig(libpng) >= 1.4.0
[riscv64] MI2a: maybe install (a providing target): libpng-devel 1.6.56-alt2:sisyphus_riscv64+116624.100.1.1 at 1774644819
[riscv64] MI2a: target SELECTED: libpng-devel 1.6.56-alt2:sisyphus_riscv64+116624.100.1.1 at 1774644819
[riscv64] MI2a: requesting to install libpng-devel (unspec'd ver; inspect with Debug::pkgMark-shallow)
[riscv64] MI2a: marked for install (shallow): libpng-devel
[riscv64] MI2a: satisfying Depends: libpng16 = 1.6.56-alt2:sisyphus_riscv64+116624.100.1.1
[riscv64] MI2a: maybe install (a direct target): libpng16 1.6.56-alt2:sisyphus_riscv64+116624.100.1.1 at 1774644819
[riscv64] MI2a: target SELECTED: libpng16 1.6.56-alt2:sisyphus_riscv64+116624.100.1.1 at 1774644819
[riscv64] MI2a: requesting to install libpng16 (unspec'd ver; inspect with Debug::pkgMark-shallow)
[riscv64] MI2a: marked for install (shallow): libpng16
[riscv64] MI2a: satisfying Depends: pkgconfig(xext) (NULL)
[riscv64] MI2a: maybe install (a providing target): libXext-devel 1.3.6-alt1:sisyphus_riscv64+46670.1100.1.1 at 1711473737
[riscv64] MI2a: target SELECTED: libXext-devel 1.3.6-alt1:sisyphus_riscv64+46670.1100.1.1 at 1711473737
[riscv64] MI2a: requesting to install libXext-devel (unspec'd ver; inspect with Debug::pkgMark-shallow)
[riscv64] MI2a: marked for install (shallow): libXext-devel
[riscv64] MI2a: satisfying Depends: libXau-devel (NULL)
[riscv64] MI2a: maybe install (a direct target): libXau-devel 1.0.11-alt1:sisyphus_riscv64+26806.100.1.1 at 1670595777
[riscv64] MI2a: target SELECTED: libXau-devel 1.0.11-alt1:sisyphus_riscv64+26806.100.1.1 at 1670595777
[riscv64] MI2a: requesting to install libXau-devel (unspec'd ver; inspect with Debug::pkgMark-shallow)
[riscv64] MI2a: marked for install (shallow): libXau-devel
[riscv64] MI2a: satisfying Depends: libXext = 1.3.6-alt1:sisyphus_riscv64+46670.1100.1.1
[riscv64] MI2a: maybe install (a direct target): libXext 1.3.6-alt1:sisyphus_riscv64+46670.1100.1.1 at 1711473737
[riscv64] MI2a: target SELECTED: libXext 1.3.6-alt1:sisyphus_riscv64+46670.1100.1.1 at 1711473737
[riscv64] MI2a: requesting to install libXext (unspec'd ver; inspect with Debug::pkgMark-shallow)
[riscv64] MI2a: marked for install (shallow): libXext
[riscv64] MI2a: satisfying Depends: pkgconfig(zlib) (NULL)
[riscv64] MI2a: maybe install (a providing target): zlib-devel 1.3.1-alt1:sisyphus_riscv64+45939.100.1.1 at 1710445788
[riscv64] MI2a: target SELECTED: zlib-devel 1.3.1-alt1:sisyphus_riscv64+45939.100.1.1 at 1710445788
[riscv64] MI2a: requesting to install zlib-devel (unspec'd ver; inspect with Debug::pkgMark-shallow)
[riscv64] MI2a: marked for install (shallow): zlib-devel
[riscv64] MI2a: satisfying Depends: libcairo = 1:1.18.4-alt1:sisyphus_riscv64+75640.100.1.1
[riscv64] MI2a: maybe install (a direct target): libcairo 1:1.18.4-alt1:sisyphus_riscv64+75640.100.1.1 at 1741606770
[riscv64] MI2a: target SELECTED: libcairo 1:1.18.4-alt1:sisyphus_riscv64+75640.100.1.1 at 1741606770
[riscv64] MI2a: requesting to install libcairo (unspec'd ver; inspect with Debug::pkgMark-shallow)
[riscv64] MI2a: marked for install (shallow): libcairo
[riscv64] MI2a: satisfying Depends: libfontconfig.so.1()(64bit) >= set:lgrzNlfZia7ygOCz07eWZ0KOYZAwpZIE58LhWZuTPkrTHdXfqrcYNCfa1
[riscv64] MI2a: maybe install (a providing target): libfontconfig1 2.18.1-alt1:sisyphus_riscv64+134533.400.1.1 at 1785822896
[riscv64] MI2a: target SELECTED: libfontconfig1 2.18.1-alt1:sisyphus_riscv64+134533.400.1.1 at 1785822896
[riscv64] MI2a: requesting to install libfontconfig1 (unspec'd ver; inspect with Debug::pkgMark-shallow)
[riscv64] MI2a: marked for install (shallow): libfontconfig1
[riscv64] MI2a: satisfying Depends: libfreetype.so.6()(64bit) >= set:lgqTiyftOqKxwdqnIV5HufX080aBTqlvVAdZBtPOwgGxyybL8jpBd9E7U1S0
[riscv64] MI2a: maybe install (a providing target): libfreetype 2.14.3-alt1:sisyphus_riscv64+116242.100.1.1 at 1774475273
[riscv64] MI2a: target SELECTED: libfreetype 2.14.3-alt1:sisyphus_riscv64+116242.100.1.1 at 1774475273
[riscv64] MI2a: requesting to install libfreetype (unspec'd ver; inspect with Debug::pkgMark-shallow)
[riscv64] MI2a: marked for install (shallow): libfreetype
[riscv64] MI2a: satisfying PreDepends: libharfbuzz (NULL)
[riscv64] MI2a: maybe install (a direct target): libharfbuzz 14.2.1-alt1:sisyphus_riscv64+134745.300.1.1 at 1785869978
[riscv64] MI2a: target SELECTED: libharfbuzz 14.2.1-alt1:sisyphus_riscv64+134745.300.1.1 at 1785869978
[riscv64] MI2a: requesting to install libharfbuzz (unspec'd ver; inspect with Debug::pkgMark-shallow)
[riscv64] MI2a: marked for install (shallow): libharfbuzz
[riscv64] MI2a: satisfying Depends: libgraphite2.so.3()(64bit) >= set:kf32hGmUjq3tuKutzOJRzIQSHEyjposq2iEoszFE7SlOdnc
[riscv64] MI2a: maybe install (a providing target): libgraphite2 1.3.15-alt1:sisyphus_riscv64+127436.200.1.1 at 1780337476
[riscv64] MI2a: target SELECTED: libgraphite2 1.3.15-alt1:sisyphus_riscv64+127436.200.1.1 at 1780337476
[riscv64] MI2a: requesting to install libgraphite2 (unspec'd ver; inspect with Debug::pkgMark-shallow)
[riscv64] MI2a: marked for install (shallow): libgraphite2
[riscv64] MI2a: satisfying Depends: libbrotlidec.so.1()(64bit) >= set:hgSP7
[riscv64] MI2a: maybe install (a providing target): libbrotlidec 1.2.0-alt1:sisyphus_riscv64+98962.100.1.1 at 1761678642
[riscv64] MI2a: target SELECTED: libbrotlidec 1.2.0-alt1:sisyphus_riscv64+98962.100.1.1 at 1761678642
[riscv64] MI2a: requesting to install libbrotlidec (unspec'd ver; inspect with Debug::pkgMark-shallow)
[riscv64] MI2a: marked for install (shallow): libbrotlidec
[riscv64] MI2a: satisfying Depends: libbrotlicommon = 1.2.0-alt1:sisyphus_riscv64+98962.100.1.1
[riscv64] MI2a: maybe install (a direct target): libbrotlicommon 1.2.0-alt1:sisyphus_riscv64+98962.100.1.1 at 1761678642
[riscv64] MI2a: target SELECTED: libbrotlicommon 1.2.0-alt1:sisyphus_riscv64+98962.100.1.1 at 1761678642
[riscv64] MI2a: requesting to install libbrotlicommon (unspec'd ver; inspect with Debug::pkgMark-shallow)
[riscv64] MI2a: marked for install (shallow): libbrotlicommon
[riscv64] MI2a: satisfying Depends: libpixman-1.so.0()(64bit) >= set:lf5ZwVcdOaeX8umXJ79HaB3YzsrHCJDfOJGHnnAQbNpbqjYwfa3veu4vGMcCZkV5LigXOOqd1gBECaxIxFZiNURf5LMuSnyxSabeKKEZosAGBKKT3SyZBY7IWI0
[riscv64] MI2a: maybe install (a providing target): libpixman 3:0.46.4-alt0.port:sisyphus_riscv64+90345.100.1.1 at 1753351026
[riscv64] MI2a: target SELECTED: libpixman 3:0.46.4-alt0.port:sisyphus_riscv64+90345.100.1.1 at 1753351026
[riscv64] MI2a: requesting to install libpixman (unspec'd ver; inspect with Debug::pkgMark-shallow)
[riscv64] MI2a: marked for install (shallow): libpixman
[riscv64] MI2a: satisfying Depends: libgraphite2-devel (NULL)
[riscv64] MI2a: maybe install (a direct target): libgraphite2-devel 1.3.15-alt1:sisyphus_riscv64+127436.200.1.1 at 1780337476
[riscv64] MI2a: target SELECTED: libgraphite2-devel 1.3.15-alt1:sisyphus_riscv64+127436.200.1.1 at 1780337476
[riscv64] MI2a: requesting to install libgraphite2-devel (unspec'd ver; inspect with Debug::pkgMark-shallow)
[riscv64] MI2a: marked for install (shallow): libgraphite2-devel
[riscv64] MI2a: satisfying Depends: libicu-devel (NULL)
[riscv64] MI2a: maybe install (a direct target): libicu-devel 1:7.8.3-alt1:sisyphus_riscv64+134745.100.1.1 at 1785868456
[riscv64] MI2a: target SELECTED: libicu-devel 1:7.8.3-alt1:sisyphus_riscv64+134745.100.1.1 at 1785868456
[riscv64] MI2a: requesting to install libicu-devel (unspec'd ver; inspect with Debug::pkgMark-shallow)
[riscv64] MI2a: marked for install (shallow): libicu-devel
[riscv64] MI2a: satisfying Depends: icu-utils = 1:7.8.3-alt1:sisyphus_riscv64+134745.100.1.1
[riscv64] MI2a: maybe install (a direct target): icu-utils 1:7.8.3-alt1:sisyphus_riscv64+134745.100.1.1 at 1785868456
[riscv64] MI2a: target SELECTED: icu-utils 1:7.8.3-alt1:sisyphus_riscv64+134745.100.1.1 at 1785868456
[riscv64] MI2a: requesting to install icu-utils (unspec'd ver; inspect with Debug::pkgMark-shallow)
[riscv64] MI2a: marked for install (shallow): icu-utils
[riscv64] MI2a: satisfying Depends: libicu78 = 1:7.8.3-alt1:sisyphus_riscv64+134745.100.1.1
[riscv64] MI2a: maybe install (a direct target): libicu78 1:7.8.3-alt1:sisyphus_riscv64+134745.100.1.1 at 1785868456
[riscv64] MI2a: target SELECTED: libicu78 1:7.8.3-alt1:sisyphus_riscv64+134745.100.1.1 at 1785868456
[riscv64] MI2a: requesting to install libicu78 (unspec'd ver; inspect with Debug::pkgMark-shallow)
[riscv64] MI2a: marked for install (shallow): libicu78
[riscv64] MI2a: satisfying Depends: libharfbuzz-icu = 14.2.1-alt1:sisyphus_riscv64+134745.300.1.1
[riscv64] MI2a: maybe install (a direct target): libharfbuzz-icu 14.2.1-alt1:sisyphus_riscv64+134745.300.1.1 at 1785869978
[riscv64] MI2a: target SELECTED: libharfbuzz-icu 14.2.1-alt1:sisyphus_riscv64+134745.300.1.1 at 1785869978
[riscv64] MI2a: requesting to install libharfbuzz-icu (unspec'd ver; inspect with Debug::pkgMark-shallow)
[riscv64] MI2a: marked for install (shallow): libharfbuzz-icu
[riscv64] MI2a: satisfying Depends: libharfbuzz-cairo = 14.2.1-alt1:sisyphus_riscv64+134745.300.1.1
[riscv64] MI2a: maybe install (a direct target): libharfbuzz-cairo 14.2.1-alt1:sisyphus_riscv64+134745.300.1.1 at 1785869978
[riscv64] MI2a: target SELECTED: libharfbuzz-cairo 14.2.1-alt1:sisyphus_riscv64+134745.300.1.1 at 1785869978
[riscv64] MI2a: requesting to install libharfbuzz-cairo (unspec'd ver; inspect with Debug::pkgMark-shallow)
[riscv64] MI2a: marked for install (shallow): libharfbuzz-cairo
[riscv64] MI2a: satisfying Depends: libharfbuzz-gobject = 14.2.1-alt1:sisyphus_riscv64+134745.300.1.1
[riscv64] MI2a: maybe install (a direct target): libharfbuzz-gobject 14.2.1-alt1:sisyphus_riscv64+134745.300.1.1 at 1785869978
[riscv64] MI2a: target SELECTED: libharfbuzz-gobject 14.2.1-alt1:sisyphus_riscv64+134745.300.1.1 at 1785869978
[riscv64] MI2a: requesting to install libharfbuzz-gobject (unspec'd ver; inspect with Debug::pkgMark-shallow)
[riscv64] MI2a: marked for install (shallow): libharfbuzz-gobject
[riscv64] MI2a: satisfying Depends: fontconfig = 2.18.1-alt1:sisyphus_riscv64+134533.400.1.1
[riscv64] MI2a: maybe install (a direct target): fontconfig 2.18.1-alt1:sisyphus_riscv64+134533.400.1.1 at 1785822896
[riscv64] MI2a: target SELECTED: fontconfig 2.18.1-alt1:sisyphus_riscv64+134533.400.1.1 at 1785822896
[riscv64] MI2a: requesting to install fontconfig (unspec'd ver; inspect with Debug::pkgMark-shallow)
[riscv64] MI2a: marked for install (shallow): fontconfig
[riscv64] rpm-build-java is already the newest version.
[riscv64] rpm-macros-alternatives is already the newest version.
[riscv64] Selecting filesystem for '/proc'
[riscv64] filesystem is already the newest version.
[riscv64] autoconf is already the newest version.
[riscv64] automake is already the newest version.
[riscv64] binutils is already the newest version.
[riscv64] Selecting libcups-devel for 'cups-devel'
[riscv64] E: Couldn't find package java-25-openjdk-devel
[riscv64] hsh-install: Failed to calculate package file list.
[riscv64] hsh-install: Failed to generate package file list.
2026-Aug-24 10:55:32 :: [riscv64] java-25-openjdk-25.0.4.1.1-alt1.src.rpm: remote: cannot build src.rpm
2026-Aug-24 10:55:32 :: [riscv64] #100 java-25-openjdk-25.0.4.1.1-alt1.src.rpm: build FAILED
2026-Aug-24 10:55:32 :: [riscv64] requesting cancellation of task processing
2026-Aug-24 10:55:33 :: [riscv64] build FAILED
2026-Aug-24 10:55:33 :: task #138241 for sisyphus_riscv64 FAILED
More information about the Riscv-reports
mailing list