[riscv-reports] [#138033] sisyphus_riscv64 FAILED (try 3) srpm=vtk-9.5.2-alt5.src.rpm
Girar sisyphus_riscv64 awaiter iv
noreply at basealt.ru
Sun Aug 23 11:59:48 MSK 2026
http://web.build.srt.basealt.ru/tasks/138033/logs/events.3.1.log
subtask name riscv64
#100 vtk failed
2026-Aug-23 08:51:04 :: task #138033 for sisyphus_riscv64 resumed by iv:
2026-Aug-23 08:51:04 :: message: sync
#100 build vtk-9.5.2-alt5.src.rpm
2026-Aug-23 08:51:15 :: [riscv64] #100 vtk-9.5.2-alt5.src.rpm: build start
[riscv64] CMake Error at CMake/vtkModule.cmake:6153 (message):
[riscv64] The variable `HDF5_IS_PARALLEL` was expected to have been available, but
[riscv64] was not defined.
[riscv64] Call Stack (most recent call first):
[riscv64] CMake/vtkModule.cmake:5861 (vtk_module_third_party_external)
[riscv64] ThirdParty/hdf5/CMakeLists.txt:3 (vtk_module_third_party)
[riscv64] -- Configuring incomplete, errors occurred!
[riscv64] error: Bad exit status from /usr/src/tmp/rpmb-tmp.CmVbkc (%build)
[riscv64] RPM build errors:
[riscv64] Bad exit status from /usr/src/tmp/rpmb-tmp.CmVbkc (%build)
2026-Aug-23 08:59:47 :: [riscv64] vtk-9.5.2-alt5.src.rpm: remote: build failed
2026-Aug-23 08:59:47 :: [riscv64] #100 vtk-9.5.2-alt5.src.rpm: build FAILED
2026-Aug-23 08:59:48 :: [riscv64] requesting cancellation of task processing
2026-Aug-23 08:59:48 :: [riscv64] build FAILED
2026-Aug-23 08:59:48 :: task #138033 for sisyphus_riscv64 FAILED
More information about the Riscv-reports
mailing list