[riscv-reports] [#138026] sisyphus_riscv64 FAILED srpm=crush-0.90.0-alt1.src.rpm

Girar sisyphus_riscv64 awaiter recycler noreply at basealt.ru
Sat Aug 22 00:17:06 MSK 2026


http://web.build.srt.basealt.ru/tasks/138026/logs/events.1.1.log

subtask  name   riscv64
   #100  crush   failed

2026-Aug-21 21:15:04 :: shared task #138026 for sisyphus_riscv64 started by recycler:
2026-Aug-21 21:15:04 :: message: sync
#100 build crush-0.90.0-alt1.src.rpm
2026-Aug-21 21:15:09 :: [riscv64] #100 crush-0.90.0-alt1.src.rpm: build start
[riscv64] 'vendor/mvdan.cc/sh/v3/syntax/quote.go' -> '/usr/src/RPM/BUILD/crush-0.90.0/.build/src/github.com/charmbracelet/crush/vendor/mvdan.cc/sh/v3/syntax/quote.go'
[riscv64] 'vendor/mvdan.cc/sh/v3/syntax/simplify.go' -> '/usr/src/RPM/BUILD/crush-0.90.0/.build/src/github.com/charmbracelet/crush/vendor/mvdan.cc/sh/v3/syntax/simplify.go'
[riscv64] 'vendor/mvdan.cc/sh/v3/syntax/token_string.go' -> '/usr/src/RPM/BUILD/crush-0.90.0/.build/src/github.com/charmbracelet/crush/vendor/mvdan.cc/sh/v3/syntax/token_string.go'
[riscv64] 'vendor/mvdan.cc/sh/v3/syntax/tokens.go' -> '/usr/src/RPM/BUILD/crush-0.90.0/.build/src/github.com/charmbracelet/crush/vendor/mvdan.cc/sh/v3/syntax/tokens.go'
[riscv64] 'vendor/mvdan.cc/sh/v3/syntax/walk.go' -> '/usr/src/RPM/BUILD/crush-0.90.0/.build/src/github.com/charmbracelet/crush/vendor/mvdan.cc/sh/v3/syntax/walk.go'
[riscv64] + /usr/share/golang/golang-build .build/src/github.com/charmbracelet/crush
[riscv64] go: go.mod requires go >= 1.26.6 (running go 1.26.5; GOTOOLCHAIN=local)
[riscv64] error: Bad exit status from /usr/src/tmp/rpmb-tmp.tabFyQ (%build)
[riscv64] RPM build errors:
[riscv64]     Bad exit status from /usr/src/tmp/rpmb-tmp.tabFyQ (%build)
2026-Aug-21 21:17:05 :: [riscv64] crush-0.90.0-alt1.src.rpm: remote: build failed
2026-Aug-21 21:17:05 :: [riscv64] #100 crush-0.90.0-alt1.src.rpm: build FAILED
2026-Aug-21 21:17:05 :: [riscv64] requesting cancellation of task processing
2026-Aug-21 21:17:06 :: [riscv64] build FAILED
2026-Aug-21 21:17:06 :: task #138026 for sisyphus_riscv64 FAILED


More information about the Riscv-reports mailing list