[riscv-reports] [#138017] sisyphus_riscv64 FAILED srpm=sdrangel-7.27.2-alt1.src.rpm
Girar sisyphus_riscv64 awaiter recycler
noreply at basealt.ru
Fri Aug 21 23:43:36 MSK 2026
http://web.build.srt.basealt.ru/tasks/138017/logs/events.1.1.log
2026-Aug-21 20:41:47 :: shared task #138017 for sisyphus_riscv64 started by recycler:
2026-Aug-21 20:41:47 :: message: sync
#100 build sdrangel-7.27.2-alt1.src.rpm
2026-Aug-21 20:42:11 :: [riscv64] #100 sdrangel-7.27.2-alt1.src.rpm: build start
2026-Aug-21 20:43:35 :: [riscv64] #100 sdrangel-7.27.2-alt1.src.rpm: build SKIPPED
2026-Aug-21 20:43:36 :: #100: sdrangel-7.27.2-alt1.src.rpm: no source package
2026-Aug-21 20:43:36 :: build check FAILED for: #100
2026-Aug-21 20:43:36 :: task #138017 for sisyphus_riscv64 FAILED
More information about the Riscv-reports
mailing list