[riscv-reports] [#137576] [test-only] sisyphus_riscv64 FAILED (try 12) kernel-image.git=k3-6.18.3-alt1.port.rv64

Girar sisyphus_riscv64 awaiter l27001 noreply at basealt.ru
Fri Aug 21 12:32:52 MSK 2026


http://web.build.srt.basealt.ru/tasks/137576/logs/events.12.1.log

subtask  name          riscv64
  #1500  kernel-image   failed

2026-Aug-21 08:26:26 :: test-only task #137576 for sisyphus_riscv64 resumed by l27001:
#100 removed
#200 removed
#300 removed
#400 removed
#500 removed
#600 removed
#700 removed
#1000 removed
#1100 removed
#1200 removed
#1300 removed
#1400 removed
#1500 build k3-6.18.3-alt1.port.rv64 from /people/l27001/packages/kernel-image.git fetched at 2026-Aug-21 08:25:52
2026-Aug-21 08:26:30 :: [riscv64] #1500 kernel-image.git k3-6.18.3-alt1.port.rv64: build start
[riscv64] + mv '/usr/src/tmp/kernel-image-k3-buildroot/lib/modules/6.18.3-k3-alt1.port.rv64/kernel/drivers/media/dvb-core/dvb-core.ko*' /usr/src/tmp/kernel-image-k3-buildroot/lib/modules/6.18.3-k3-alt1.port.rv64/kernel/drivers/media-core/
[riscv64] mv: cannot stat '/usr/src/tmp/kernel-image-k3-buildroot/lib/modules/6.18.3-k3-alt1.port.rv64/kernel/drivers/media/dvb-core/dvb-core.ko*': No such file or directory
[riscv64] error: Bad exit status from /usr/src/tmp/rpmb-tmp.rzt0gy (%install)
2026-Aug-21 09:32:52 :: [riscv64] kernel-image.git k3-6.18.3-alt1.port.rv64: remote: build failed
2026-Aug-21 09:32:52 :: [riscv64] #1500 kernel-image.git k3-6.18.3-alt1.port.rv64: build FAILED
2026-Aug-21 09:32:52 :: [riscv64] requesting cancellation of task processing
2026-Aug-21 09:32:52 :: [riscv64] build FAILED
2026-Aug-21 09:32:52 :: task #137576 for sisyphus_riscv64 FAILED


More information about the Riscv-reports mailing list