[riscv-reports] [#137850] sisyphus_riscv64 FAILED (try 2) srpm=vtk-9.5.2-alt5.src.rpm srpm=alizams-1.10.0-alt2.src.rpm ...
Girar sisyphus_riscv64 awaiter recycler
noreply at basealt.ru
Fri Aug 21 10:48:17 MSK 2026
http://web.build.srt.basealt.ru/tasks/137850/logs/events.2.1.log
subtask name riscv64
#100 vtk failed
2026-Aug-21 07:38:52 :: shared task #137850 for sisyphus_riscv64 resumed by recycler:
2026-Aug-21 07:38:52 :: message: sync
#100 build vtk-9.5.2-alt5.src.rpm
#200 build alizams-1.10.0-alt2.src.rpm
#300 build elmerfem-26.2.1-alt4.src.rpm
2026-Aug-21 07:38:53 :: created build repo
2026-Aug-21 07:38:59 :: [riscv64] #100 vtk-9.5.2-alt5.src.rpm: build start
[riscv64] /usr/lib64/cmake/hdf5/hdf5-config.cmake:266 (include)
[riscv64] CMake/patches/99/FindHDF5.cmake:501 (find_package)
[riscv64] CMake/vtkModule.cmake:5351 (find_package)
[riscv64] CMake/vtkModule.cmake:5994 (vtk_module_find_package)
[riscv64] CMake/vtkModule.cmake:5861 (vtk_module_third_party_external)
[riscv64] ThirdParty/hdf5/CMakeLists.txt:3 (vtk_module_third_party)
[riscv64] -- Configuring incomplete, errors occurred!
[riscv64] error: Bad exit status from /usr/src/tmp/rpmb-tmp.BSpiBP (%build)
[riscv64] RPM build errors:
[riscv64] Bad exit status from /usr/src/tmp/rpmb-tmp.BSpiBP (%build)
2026-Aug-21 07:48:16 :: [riscv64] vtk-9.5.2-alt5.src.rpm: remote: build failed
2026-Aug-21 07:48:16 :: [riscv64] #100 vtk-9.5.2-alt5.src.rpm: build FAILED
2026-Aug-21 07:48:16 :: [riscv64] requesting cancellation of task processing
2026-Aug-21 07:48:16 :: [riscv64] build FAILED
2026-Aug-21 07:48:16 :: task #137850 for sisyphus_riscv64 FAILED
More information about the Riscv-reports
mailing list