[riscv-reports] [#137344] sisyphus_riscv64 FAILED srpm=onnxruntime-1.29.0-alt1.src.rpm srpm=calibre-8.16.2-alt1.src.rpm ...

Girar sisyphus_riscv64 awaiter recycler noreply at basealt.ru
Mon Aug 17 01:11:21 MSK 2026


http://web.build.srt.basealt.ru/tasks/137344/logs/events.1.1.log

subtask  name         riscv64
   #100  onnxruntime   failed

2026-Aug-16 22:01:23 :: shared task #137344 for sisyphus_riscv64 started by recycler:
2026-Aug-16 22:01:23 :: message: sync
#100 build onnxruntime-1.29.0-alt1.src.rpm
#200 build calibre-8.16.2-alt1.src.rpm
#300 build crow-translate-4.0.2-alt1.src.rpm
#400 build python3-module-magika-1.0.3-alt1.src.rpm
2026-Aug-16 22:01:23 :: created build repo
2026-Aug-16 22:01:41 :: [riscv64] #100 onnxruntime-1.29.0-alt1.src.rpm: build start
[riscv64]   Each download failed!
[riscv64]     error: downloading 'https://github.com/google/pthreadpool/archive/dcc9f28589066af0dbd4555579281230abbf74dd.zip' failed
[riscv64]           status_code: 6
[riscv64] --
[riscv64]           --- LOG END ---
[riscv64]           error: downloading 'https://github.com/google/pthreadpool/archive/dcc9f28589066af0dbd4555579281230abbf74dd.zip' failed
[riscv64]           status_code: 6
[riscv64] --
[riscv64]           --- LOG END ---
[riscv64]           error: downloading 'https://github.com/google/pthreadpool/archive/dcc9f28589066af0dbd4555579281230abbf74dd.zip' failed
[riscv64]           status_code: 6
[riscv64] --
[riscv64]           --- LOG END ---
[riscv64]           error: downloading 'https://github.com/google/pthreadpool/archive/dcc9f28589066af0dbd4555579281230abbf74dd.zip' failed
[riscv64]           status_code: 6
[riscv64] --
[riscv64]           --- LOG END ---
[riscv64]           error: downloading 'https://github.com/google/pthreadpool/archive/dcc9f28589066af0dbd4555579281230abbf74dd.zip' failed
[riscv64]           status_code: 6
[riscv64] --
[riscv64]           --- LOG END ---
[riscv64]           error: downloading 'https://github.com/google/pthreadpool/archive/dcc9f28589066af0dbd4555579281230abbf74dd.zip' failed
[riscv64]           status_code: 6
2026-Aug-16 22:11:21 :: [riscv64] onnxruntime-1.29.0-alt1.src.rpm: remote: build failed
2026-Aug-16 22:11:21 :: [riscv64] #100 onnxruntime-1.29.0-alt1.src.rpm: build FAILED
2026-Aug-16 22:11:21 :: [riscv64] requesting cancellation of task processing
2026-Aug-16 22:11:21 :: [riscv64] build FAILED
2026-Aug-16 22:11:21 :: task #137344 for sisyphus_riscv64 FAILED


More information about the Riscv-reports mailing list