[riscv-reports] [#137117] sisyphus_riscv64 FAILED srpm=skim-5.6.4-alt1.src.rpm
Girar sisyphus_riscv64 awaiter recycler
noreply at basealt.ru
Fri Aug 14 16:15:33 MSK 2026
http://web.build.srt.basealt.ru/tasks/137117/logs/events.1.1.log
2026-Aug-14 13:13:46 :: shared task #137117 for sisyphus_riscv64 started by recycler:
2026-Aug-14 13:13:46 :: message: sync
#100 build skim-5.6.4-alt1.src.rpm
2026-Aug-14 13:13:52 :: [riscv64] #100 skim-5.6.4-alt1.src.rpm: build start
2026-Aug-14 13:15:32 :: [riscv64] #100 skim-5.6.4-alt1.src.rpm: build SKIPPED
2026-Aug-14 13:15:33 :: #100: skim-5.6.4-alt1.src.rpm: no source package
2026-Aug-14 13:15:33 :: build check FAILED for: #100
2026-Aug-14 13:15:33 :: task #137117 for sisyphus_riscv64 FAILED
More information about the Riscv-reports
mailing list