[riscv-reports] [#137109] sisyphus_riscv64 FAILED srpm=procdump-3.5.2-alt2.src.rpm

Girar sisyphus_riscv64 awaiter recycler noreply at basealt.ru
Fri Aug 14 15:56:58 MSK 2026


http://web.build.srt.basealt.ru/tasks/137109/logs/events.1.1.log

2026-Aug-14 12:55:48 :: shared task #137109 for sisyphus_riscv64 started by recycler:
2026-Aug-14 12:55:48 :: message: sync
#100 build procdump-3.5.2-alt2.src.rpm
2026-Aug-14 12:55:55 :: [riscv64] #100 procdump-3.5.2-alt2.src.rpm: build start
2026-Aug-14 12:56:58 :: [riscv64] #100 procdump-3.5.2-alt2.src.rpm: build SKIPPED
2026-Aug-14 12:56:58 :: #100: procdump-3.5.2-alt2.src.rpm: no source package
2026-Aug-14 12:56:58 :: build check FAILED for: #100 
2026-Aug-14 12:56:58 :: task #137109 for sisyphus_riscv64 FAILED


More information about the Riscv-reports mailing list