[riscv-reports] [#136932] sisyphus_riscv64 FAILED srpm=qgis-4.2.1-alt1.src.rpm

Girar sisyphus_riscv64 awaiter recycler noreply at basealt.ru
Thu Aug 13 02:06:00 MSK 2026


http://web.build.srt.basealt.ru/tasks/136932/logs/events.1.1.log

subtask  name  riscv64
   #100  qgis   failed

2026-Aug-12 20:34:13 :: shared task #136932 for sisyphus_riscv64 started by recycler:
2026-Aug-12 20:34:13 :: message: sync
#100 build qgis-4.2.1-alt1.src.rpm
2026-Aug-12 20:34:18 :: [riscv64] #100 qgis-4.2.1-alt1.src.rpm: build start
[riscv64] -- Installing: /usr/src/tmp/qgis-buildroot/usr/share/qgis/FindQGIS.cmake
[riscv64] /usr/src/RPM/BUILD/qgis-4.2.1/output/bin/crssync: error while loading shared libraries: libqgis_core.so.4.2.1: cannot open shared object file: No such file or directory
[riscv64] -- Installing: /usr/src/tmp/qgis-buildroot/usr/share/icons/hicolor/scalable/apps/qgis.svg
[riscv64] --
[riscv64] + sed -i /QtWebEngine/d /usr/src/tmp/qgis-buildroot/usr/share/qgis/python/qsci_apis/PyQt6.api
[riscv64] sed: can't read /usr/src/tmp/qgis-buildroot/usr/share/qgis/python/qsci_apis/PyQt6.api: No such file or directory
[riscv64] error: Bad exit status from /usr/src/tmp/rpmb-tmp.GSZJ6w (%install)
2026-Aug-12 23:05:59 :: [riscv64] qgis-4.2.1-alt1.src.rpm: remote: build failed
2026-Aug-12 23:05:59 :: [riscv64] #100 qgis-4.2.1-alt1.src.rpm: build FAILED
2026-Aug-12 23:05:59 :: [riscv64] requesting cancellation of task processing
2026-Aug-12 23:05:59 :: [riscv64] build FAILED
2026-Aug-12 23:05:59 :: task #136932 for sisyphus_riscv64 FAILED


More information about the Riscv-reports mailing list