[riscv-reports] [#136922] sisyphus_riscv64 FAILED srpm=semcode-20260802-alt1.src.rpm
Girar sisyphus_riscv64 awaiter recycler
noreply at basealt.ru
Wed Aug 12 23:29:15 MSK 2026
http://web.build.srt.basealt.ru/tasks/136922/logs/events.1.1.log
2026-Aug-12 20:27:51 :: shared task #136922 for sisyphus_riscv64 started by recycler:
2026-Aug-12 20:27:51 :: message: sync
#100 build semcode-20260802-alt1.src.rpm
2026-Aug-12 20:27:57 :: [riscv64] #100 semcode-20260802-alt1.src.rpm: build start
2026-Aug-12 20:29:14 :: [riscv64] #100 semcode-20260802-alt1.src.rpm: build SKIPPED
2026-Aug-12 20:29:15 :: #100: semcode-20260802-alt1.src.rpm: no source package
2026-Aug-12 20:29:15 :: build check FAILED for: #100
2026-Aug-12 20:29:15 :: task #136922 for sisyphus_riscv64 FAILED
More information about the Riscv-reports
mailing list