[riscv-reports] [#136703] sisyphus_riscv64 FAILED srpm=python3-module-apsw-3.53.3.1-alt1.src.rpm

Girar sisyphus_riscv64 awaiter recycler noreply at basealt.ru
Wed Aug 12 05:54:45 MSK 2026


http://web.build.srt.basealt.ru/tasks/136703/logs/events.1.1.log

subtask  name                 riscv64
   #100  python3-module-apsw   failed

2026-Aug-12 02:53:24 :: shared task #136703 for sisyphus_riscv64 started by recycler:
2026-Aug-12 02:53:24 :: message: sync
#100 build python3-module-apsw-3.53.3.1-alt1.src.rpm
2026-Aug-12 02:53:30 :: [riscv64] #100 python3-module-apsw-3.53.3.1-alt1.src.rpm: build start
[riscv64] warning: user aris does not exist - using root
[riscv64] warning: group aris does not exist - using root
[riscv64] warning: user aris does not exist - using root
[riscv64] warning: group aris does not exist - using root
[riscv64] <13>Aug 12 02:54:37 rpmi: libgdbm6-1.26-alt1 sisyphus_riscv64+126243.100.1.1 1779345791 installed
[riscv64] <13>Aug 12 02:54:37 rpmi: libgdbm_compat4-1.26-alt1 sisyphus_riscv64+126243.100.1.1 1779345791 installed
[riscv64] <13>Aug 12 02:54:37 rpmi: python3-stable_abi-3.14.6-alt2 sisyphus_riscv64+135987.100.1.1 1786208046 installed
[riscv64] <13>Aug 12 02:54:37 rpmi: libsqlite3-3.50.4-alt1 sisyphus_riscv64+91443.100.1.1 1754555936 installed
[riscv64] <13>Aug 12 02:54:37 rpmi: libmpdec3-2.5.1-alt3 sisyphus_riscv64+29035.100.1.1 1675621702 installed
[riscv64] <13>Aug 12 02:54:37 rpmi: libexpat-2.7.4-alt1 sisyphus_riscv64+109313.100.1.1 1770323898 installed
[riscv64] <13>Aug 12 02:54:37 rpmi: openssl-config-3.5.0-alt1 sisyphus_riscv64+99925.100.1.1 1762587030 installed
[riscv64] <13>Aug 12 02:54:37 rpmi: libp11-kit-1:0.26.2-alt3.g0eedd4d sisyphus_riscv64+132157.100.2.1 1783619252 installed
[riscv64] <13>Aug 12 02:54:37 rpmi: libtasn1-4.21.0-alt2 sisyphus_riscv64+128673.100.1.1 1781194651 installed
[riscv64] <13>Aug 12 02:54:37 rpmi: rpm-macros-alternatives-0.5.3-alt1 sisyphus_riscv64+71244.100.1.1 1738025117 installed
[riscv64] <13>Aug 12 02:54:37 rpmi: alternatives-0.5.3-alt1 sisyphus_riscv64+71244.100.1.1 1738025117 installed
[riscv64] <13>Aug 12 02:54:37 rpmi: ca-certificates-2026.04.22-alt1 sisyphus_riscv64+124784.100.1.1 1778294417 installed
[riscv64] <13>Aug 12 02:54:37 rpmi: ca-trust-0.2.0-alt1 sisyphus_riscv64+47419.100.1.1 1712764300 installed
[riscv64] <13>Aug 12 02:54:37 rpmi: p11-kit-trust-1:0.26.2-alt3.g0eedd4d sisyphus_riscv64+132157.100.2.1 1783619252 installed
[riscv64] <13>Aug 12 02:54:37 rpmi: libcrypto3-3.5.7-alt1 sisyphus_riscv64+133681.100.1.1 1785499930 installed
[riscv64] <13>Aug 12 02:54:37 rpmi: libssl3-3.5.7-alt1 sisyphus_riscv64+133681.100.1.1 1785499930 installed
[riscv64] <13>Aug 12 02:54:37 rpmi: python3-modules-sqlite3-3.14.6-alt2 sisyphus_riscv64+135987.100.1.1 1786208046 installed
[riscv64] <13>Aug 12 02:54:38 rpmi: python3-3.14.6-alt2 sisyphus_riscv64+135987.100.1.1 1786208046 installed
[riscv64] <13>Aug 12 02:54:39 rpmi: python3-base-3.14.6-alt2 sisyphus_riscv64+135987.100.1.1 1786208046 installed
[riscv64] <13>Aug 12 02:54:39 rpmi: python3-module-py3dephell-0.3.1-alt1 sisyphus_riscv64+67758.200.1.1 1734524951 installed
[riscv64] <13>Aug 12 02:54:39 rpmi: tests-for-installed-python3-pkgs-0.1.30-alt1 sisyphus_riscv64+135987.200.1.1 1786208594 installed
[riscv64] <13>Aug 12 02:54:39 rpmi: rpm-build-python3-0.1.30-alt1 sisyphus_riscv64+135987.200.1.1 1786208594 installed
[riscv64] WARNING: %python3_build is deprecated and will be removed in future, please use %pyproject_build instead
[riscv64] WARNING: %python3_install is deprecated and will be removed in future, please use %pyproject_install instead
[riscv64] Reading Package Lists...
[riscv64] Building Dependency Tree...
[riscv64] MI2a: marked for install (shallow): unzip
[riscv64] MI2a:  satisfying Depends: libnatspec.so.0()(64bit) >= set:iglRMQb
[riscv64] MI2a:   maybe install (a providing target): libnatspec 0.3.5-alt1:sisyphus_riscv64+98744.100.1.1 at 1761626646
[riscv64] MI2a:  target SELECTED: libnatspec 0.3.5-alt1:sisyphus_riscv64+98744.100.1.1 at 1761626646
[riscv64] MI2a:  requesting to install libnatspec (unspec'd ver; inspect with Debug::pkgMark-shallow)
[riscv64] MI2a:    marked for install (shallow): libnatspec
[riscv64] rpm-build-python3 is already the newest version.
[riscv64] E: Version >='3.53.3' for 'libsqlite3-devel' was not found
[riscv64] hsh-install: Failed to calculate package file list.
[riscv64] hsh-install: Failed to generate package file list.
2026-Aug-12 02:54:45 :: [riscv64] python3-module-apsw-3.53.3.1-alt1.src.rpm: remote: cannot build src.rpm
2026-Aug-12 02:54:45 :: [riscv64] #100 python3-module-apsw-3.53.3.1-alt1.src.rpm: build FAILED
2026-Aug-12 02:54:45 :: [riscv64] requesting cancellation of task processing
2026-Aug-12 02:54:45 :: [riscv64] build FAILED
2026-Aug-12 02:54:45 :: task #136703 for sisyphus_riscv64 FAILED


More information about the Riscv-reports mailing list