[riscv-reports] [#136697] sisyphus_riscv64 FAILED srpm=onnxruntime-1.28.0-alt1.src.rpm srpm=calibre-8.16.2-alt1.src.rpm ...

Girar sisyphus_riscv64 awaiter recycler noreply at basealt.ru
Wed Aug 12 03:16:30 MSK 2026


http://web.build.srt.basealt.ru/tasks/136697/logs/events.1.1.log

subtask  name            riscv64
   #100  onnxruntime       47:56
   #300  crow-translate     9:42

2026-Aug-11 23:16:49 :: shared task #136697 for sisyphus_riscv64 started by recycler:
2026-Aug-11 23:16:49 :: message: sync
#100 build onnxruntime-1.28.0-alt1.src.rpm
#200 build calibre-8.16.2-alt1.src.rpm
#300 build crow-translate-4.0.2-alt1.src.rpm
2026-Aug-11 23:16:49 :: created build repo
2026-Aug-11 23:16:54 :: [riscv64] #100 onnxruntime-1.28.0-alt1.src.rpm: build start
2026-Aug-12 00:04:50 :: [riscv64] #100 onnxruntime-1.28.0-alt1.src.rpm: build OK
2026-Aug-12 00:04:50 :: [riscv64] #200 calibre-8.16.2-alt1.src.rpm: build start
2026-Aug-12 00:06:44 :: [riscv64] #200 calibre-8.16.2-alt1.src.rpm: build SKIPPED
2026-Aug-12 00:06:44 :: [riscv64] #300 crow-translate-4.0.2-alt1.src.rpm: build start
2026-Aug-12 00:16:26 :: [riscv64] #300 crow-translate-4.0.2-alt1.src.rpm: build OK
2026-Aug-12 00:16:29 :: 100: build check OK
2026-Aug-12 00:16:29 :: #200: calibre-8.16.2-alt1.src.rpm: no source package
2026-Aug-12 00:16:30 :: 300: build check OK
2026-Aug-12 00:16:30 :: build check FAILED for: #200 
2026-Aug-12 00:16:30 :: task #136697 for sisyphus_riscv64 FAILED


More information about the Riscv-reports mailing list