[riscv-reports] [#136458] sisyphus_riscv64 FAILED srpm=clickhouse-26.3.17.110-alt1.src.rpm
Girar sisyphus_riscv64 awaiter recycler
noreply at basealt.ru
Tue Aug 11 12:08:10 MSK 2026
http://web.build.srt.basealt.ru/tasks/136458/logs/events.1.1.log
2026-Aug-11 09:05:46 :: shared task #136458 for sisyphus_riscv64 started by recycler:
2026-Aug-11 09:05:46 :: message: sync
#100 build clickhouse-26.3.17.110-alt1.src.rpm
2026-Aug-11 09:05:52 :: [riscv64] #100 clickhouse-26.3.17.110-alt1.src.rpm: build start
2026-Aug-11 09:08:05 :: [riscv64] #100 clickhouse-26.3.17.110-alt1.src.rpm: build SKIPPED
2026-Aug-11 09:08:09 :: #100: clickhouse-26.3.17.110-alt1.src.rpm: no source package
2026-Aug-11 09:08:10 :: build check FAILED for: #100
2026-Aug-11 09:08:10 :: task #136458 for sisyphus_riscv64 FAILED
More information about the Riscv-reports
mailing list