[riscv-reports] [#136429] sisyphus_riscv64 FAILED srpm=keycloak-26.7.1-alt1.src.rpm

Girar sisyphus_riscv64 awaiter recycler noreply at basealt.ru
Tue Aug 11 11:09:07 MSK 2026


http://web.build.srt.basealt.ru/tasks/136429/logs/events.1.1.log

2026-Aug-11 08:06:14 :: shared task #136429 for sisyphus_riscv64 started by recycler:
2026-Aug-11 08:06:14 :: message: sync
#100 build keycloak-26.7.1-alt1.src.rpm
2026-Aug-11 08:06:18 :: [riscv64] #100 keycloak-26.7.1-alt1.src.rpm: build start
2026-Aug-11 08:09:05 :: [riscv64] #100 keycloak-26.7.1-alt1.src.rpm: build SKIPPED
2026-Aug-11 08:09:07 :: #100: keycloak-26.7.1-alt1.src.rpm: no source package
2026-Aug-11 08:09:07 :: build check FAILED for: #100 
2026-Aug-11 08:09:07 :: task #136429 for sisyphus_riscv64 FAILED


More information about the Riscv-reports mailing list