[riscv-reports] [#135877] sisyphus_riscv64 FAILED srpm=cilium-1.19.3-alt3.src.rpm
Girar sisyphus_riscv64 awaiter recycler
noreply at basealt.ru
Sat Aug 8 12:26:28 MSK 2026
http://web.build.srt.basealt.ru/tasks/135877/logs/events.1.1.log
2026-Aug-08 09:25:17 :: shared task #135877 for sisyphus_riscv64 started by recycler:
2026-Aug-08 09:25:17 :: message: sync
#100 build cilium-1.19.3-alt3.src.rpm
2026-Aug-08 09:25:23 :: [riscv64] #100 cilium-1.19.3-alt3.src.rpm: build start
2026-Aug-08 09:26:28 :: [riscv64] #100 cilium-1.19.3-alt3.src.rpm: build SKIPPED
2026-Aug-08 09:26:28 :: #100: cilium-1.19.3-alt3.src.rpm: no source package
2026-Aug-08 09:26:28 :: build check FAILED for: #100
2026-Aug-08 09:26:28 :: task #135877 for sisyphus_riscv64 FAILED
More information about the Riscv-reports
mailing list