[riscv-reports] [#135841] sisyphus_riscv64 FAILED srpm=python3-module-pysidesix-frameless-window-0.8.2-alt1.src.rpm

Girar sisyphus_riscv64 awaiter recycler noreply at basealt.ru
Sat Aug 8 10:27:10 MSK 2026


http://web.build.srt.basealt.ru/tasks/135841/logs/events.1.1.log

subtask  name                                       riscv64
   #100  python3-module-pysidesix-frameless-window     2:18

2026-Aug-08 07:23:42 :: shared task #135841 for sisyphus_riscv64 started by recycler:
2026-Aug-08 07:23:42 :: message: sync
#100 build python3-module-pysidesix-frameless-window-0.8.2-alt1.src.rpm
2026-Aug-08 07:23:48 :: [riscv64] #100 python3-module-pysidesix-frameless-window-0.8.2-alt1.src.rpm: build start
2026-Aug-08 07:26:06 :: [riscv64] #100 python3-module-pysidesix-frameless-window-0.8.2-alt1.src.rpm: build OK
2026-Aug-08 07:26:07 :: 100: build check OK
2026-Aug-08 07:26:07 :: build check OK
2026-Aug-08 07:26:07 :: #100: python3-module-pysidesix-frameless-window-0.8.2-alt1.src.rpm: version check OK
2026-Aug-08 07:26:07 :: build version check OK
2026-Aug-08 07:26:07 :: noarch check OK
2026-Aug-08 07:26:08 :: plan: src +1 -0 =21455, riscv64 +1 -0 =37898
2026-Aug-08 07:26:32 :: patched apt indices
2026-Aug-08 07:26:35 :: created next repo
2026-Aug-08 07:26:45 :: duplicate provides check OK
	riscv64: NEW unmet dependencies detected:
 python3-module-pysidesix-frameless-window#0.8.2-alt1:sisyphus_riscv64+135841.100.1.1 at 1786173961  python3(PySide6.QtWebEngineWidgets) < 0
	ACLs of affected packages (1):
 python3-module-pysidesix-frameless-window
2026-Aug-08 07:27:10 :: unmets: riscv64 +1 -0 =1
2026-Aug-08 07:27:10 :: dependencies check FAILED
2026-Aug-08 07:27:10 :: task #135841 for sisyphus_riscv64 FAILED


More information about the Riscv-reports mailing list