[riscv-reports] [#135641] sisyphus_riscv64 FAILED srpm=rpcs3-0.0.42-alt1.src.rpm
Girar sisyphus_riscv64 awaiter recycler
noreply at basealt.ru
Sat Aug 8 06:02:16 MSK 2026
http://web.build.srt.basealt.ru/tasks/135641/logs/events.1.1.log
2026-Aug-08 03:01:02 :: shared task #135641 for sisyphus_riscv64 started by recycler:
2026-Aug-08 03:01:02 :: message: sync
#100 build rpcs3-0.0.42-alt1.src.rpm
2026-Aug-08 03:01:13 :: [riscv64] #100 rpcs3-0.0.42-alt1.src.rpm: build start
2026-Aug-08 03:02:15 :: [riscv64] #100 rpcs3-0.0.42-alt1.src.rpm: build SKIPPED
2026-Aug-08 03:02:15 :: #100: rpcs3-0.0.42-alt1.src.rpm: no source package
2026-Aug-08 03:02:15 :: build check FAILED for: #100
2026-Aug-08 03:02:15 :: task #135641 for sisyphus_riscv64 FAILED
More information about the Riscv-reports
mailing list