[riscv-reports] [#135118] sisyphus_riscv64 FAILED srpm=skim-5.6.1-alt1.src.rpm

Girar sisyphus_riscv64 awaiter recycler noreply at basealt.ru
Fri Aug 7 03:07:27 MSK 2026


http://web.build.srt.basealt.ru/tasks/135118/logs/events.1.1.log

2026-Aug-07 00:05:19 :: shared task #135118 for sisyphus_riscv64 started by recycler:
2026-Aug-07 00:05:19 :: message: sync
#100 build skim-5.6.1-alt1.src.rpm
2026-Aug-07 00:05:29 :: [riscv64] #100 skim-5.6.1-alt1.src.rpm: build start
2026-Aug-07 00:07:26 :: [riscv64] #100 skim-5.6.1-alt1.src.rpm: build SKIPPED
2026-Aug-07 00:07:27 :: #100: skim-5.6.1-alt1.src.rpm: no source package
2026-Aug-07 00:07:27 :: build check FAILED for: #100 
2026-Aug-07 00:07:27 :: task #135118 for sisyphus_riscv64 FAILED


More information about the Riscv-reports mailing list