[riscv-reports] [#135022] [test-only] sisyphus_riscv64 FAILED (try 3) srpm=libopencv-4.14.0-alt1.src.rpm srpm=apriltag-3.4.5-alt1.src.rpm ...
Girar sisyphus_riscv64 awaiter recycler
noreply at basealt.ru
Thu Aug 6 23:17:09 MSK 2026
http://web.build.srt.basealt.ru/tasks/135022/logs/events.3.1.log
subtask name riscv64
#1400 libopenimageio failed
#1500 libopenshot 14:15
#1700 mlt7 14:18
#2100 nomacs 12:02
#2200 openmvg 32:18
#2300 opentoonz 34:08
#2500 postprocessd 4:30
#3100 shotwell 10:06
#3200 simarrange 3:10
#3300 siril 14:09
#3400 spectacle 10:32
#3500 ueberzugpp 5:30
#3600 libopencv4.13 1:54:56
#3700 wl-kbptr 4:08
#4000 xsnow 5:31
2026-Aug-06 14:48:45 :: test-only shared task #135022 for sisyphus_riscv64 resumed by recycler:
2026-Aug-06 14:48:45 :: message: sync
#100 build libopencv-4.14.0-alt1.src.rpm
#200 build apriltag-3.4.5-alt1.src.rpm
#300 build deepin-ocr-plugin-manager-1.0.1-alt1.src.rpm
#400 build digikam-9.1.0-alt1.src.rpm
#500 build dtkmultimedia-6.0.4-alt3.src.rpm
#600 build eviacam-2.1.4-alt3.src.rpm
#700 build frei0r-plugins-3.2.3-alt1.src.rpm
#1000 build kcm-howdy-6.0.2-alt1.src.rpm
#1100 build kstars-3.8.2-alt2.src.rpm
#1200 build libakaze-0.1.1-alt1.src.rpm
#1300 removed
#1400 build libopenimageio-3.1.15.0-alt1.src.rpm
#1500 build libopenshot-0.7.0-alt1.src.rpm
#1600 build mauikit-imagetools-4.0.2-alt1.src.rpm
#1700 build mlt7-7.36.1-alt1.src.rpm
#2000 build monado-25.1.0-alt4.src.rpm
#2100 build nomacs-3.22.1-alt1.src.rpm
#2200 build openmvg-2.1.23-alt1.src.rpm
#2300 build opentoonz-1.8.0-alt1.src.rpm
#2400 build os-autoinst-4.6-alt27.git2d0c10da.src.rpm
#2500 build postprocessd-0.3.0-alt2.src.rpm
#2600 removed
#2700 build rtabmap-0.23.8-alt1.src.rpm
#3000 build sdrangel-7.27.1-alt1.src.rpm
#3100 build shotwell-0.32.17-alt1.src.rpm
#3200 build simarrange-0.0-alt4.git0f1fbef.src.rpm
#3300 build siril-1.4.3-alt1.src.rpm
#3400 build spectacle-6.7.3-alt1.src.rpm
#3500 build ueberzugpp-2.9.10-alt1.src.rpm
#3600 build libopencv4.13-4.13.0-alt2.src.rpm
#3700 build wl-kbptr-0.4.1-alt1.src.rpm
#4000 build xsnow-3.9.1-alt1.src.rpm
2026-Aug-06 14:48:45 :: created build repo
2026-Aug-06 14:48:50 :: [riscv64] #100 libopencv-4.14.0-alt1.src.rpm: build start
2026-Aug-06 14:49:03 :: [riscv64] #100 libopencv-4.14.0-alt1.src.rpm: build swiftly SKIPPED
2026-Aug-06 14:49:03 :: [riscv64] #200 apriltag-3.4.5-alt1.src.rpm: build start
2026-Aug-06 14:49:05 :: [riscv64] #200 apriltag-3.4.5-alt1.src.rpm: build swiftly SKIPPED
2026-Aug-06 14:49:06 :: [riscv64] #300 deepin-ocr-plugin-manager-1.0.1-alt1.src.rpm: build start
2026-Aug-06 14:49:09 :: [riscv64] #300 deepin-ocr-plugin-manager-1.0.1-alt1.src.rpm: build swiftly SKIPPED
2026-Aug-06 14:49:09 :: [riscv64] #400 digikam-9.1.0-alt1.src.rpm: build start
2026-Aug-06 14:51:58 :: [riscv64] #400 digikam-9.1.0-alt1.src.rpm: build SKIPPED
2026-Aug-06 14:51:58 :: [riscv64] #500 dtkmultimedia-6.0.4-alt3.src.rpm: build start
2026-Aug-06 14:52:02 :: [riscv64] #500 dtkmultimedia-6.0.4-alt3.src.rpm: build swiftly SKIPPED
2026-Aug-06 14:52:02 :: [riscv64] #600 eviacam-2.1.4-alt3.src.rpm: build start
2026-Aug-06 14:52:05 :: [riscv64] #600 eviacam-2.1.4-alt3.src.rpm: build swiftly SKIPPED
2026-Aug-06 14:52:05 :: [riscv64] #700 frei0r-plugins-3.2.3-alt1.src.rpm: build start
2026-Aug-06 14:52:08 :: [riscv64] #700 frei0r-plugins-3.2.3-alt1.src.rpm: build swiftly SKIPPED
2026-Aug-06 14:52:08 :: [riscv64] #1000 kcm-howdy-6.0.2-alt1.src.rpm: build start
2026-Aug-06 14:52:11 :: [riscv64] #1000 kcm-howdy-6.0.2-alt1.src.rpm: build swiftly SKIPPED
2026-Aug-06 14:52:11 :: [riscv64] #1100 kstars-3.8.2-alt2.src.rpm: build start
2026-Aug-06 14:52:17 :: [riscv64] #1100 kstars-3.8.2-alt2.src.rpm: build swiftly SKIPPED
2026-Aug-06 14:52:17 :: [riscv64] #1200 libakaze-0.1.1-alt1.src.rpm: build start
2026-Aug-06 14:52:20 :: [riscv64] #1200 libakaze-0.1.1-alt1.src.rpm: build swiftly SKIPPED
2026-Aug-06 14:52:20 :: [riscv64] #1400 libopenimageio-3.1.15.0-alt1.src.rpm: build start
[riscv64] Total time: 4m 35.9s
[riscv64] ERRORS!
[riscv64] 142/143 Test #4: oiiotool ................................ Passed 345.38 sec
[riscv64] 143/143 Test #118: unit_atomic ............................. Passed 930.09 sec
[riscv64] 98% tests passed, 3 tests failed out of 143
[riscv64] Total Test time (real) = 964.98 sec
[riscv64] The following tests FAILED:
[riscv64] 23 - maketx (Failed)
2026-Aug-06 15:28:48 :: [riscv64] libopenimageio-3.1.15.0-alt1.src.rpm: remote: build failed
2026-Aug-06 15:28:48 :: [riscv64] #1400 libopenimageio-3.1.15.0-alt1.src.rpm: build FAILED
2026-Aug-06 15:28:48 :: [riscv64] #1400 libopenimageio-3.1.15.0-alt1.src.rpm:: KEEP_GOING cheat activated, moving on
2026-Aug-06 15:28:49 :: [riscv64] #1500 libopenshot-0.7.0-alt1.src.rpm: build start
2026-Aug-06 15:43:04 :: [riscv64] #1500 libopenshot-0.7.0-alt1.src.rpm: build OK
2026-Aug-06 15:43:04 :: [riscv64] #1600 mauikit-imagetools-4.0.2-alt1.src.rpm: build start
2026-Aug-06 15:44:35 :: [riscv64] #1600 mauikit-imagetools-4.0.2-alt1.src.rpm: build SKIPPED
2026-Aug-06 15:44:35 :: [riscv64] #1700 mlt7-7.36.1-alt1.src.rpm: build start
2026-Aug-06 15:58:53 :: [riscv64] #1700 mlt7-7.36.1-alt1.src.rpm: build OK
2026-Aug-06 15:58:53 :: [riscv64] #2000 monado-25.1.0-alt4.src.rpm: build start
2026-Aug-06 16:00:23 :: [riscv64] #2000 monado-25.1.0-alt4.src.rpm: build SKIPPED
2026-Aug-06 16:00:23 :: [riscv64] #2100 nomacs-3.22.1-alt1.src.rpm: build start
2026-Aug-06 16:12:25 :: [riscv64] #2100 nomacs-3.22.1-alt1.src.rpm: build OK
2026-Aug-06 16:12:25 :: [riscv64] #2200 openmvg-2.1.23-alt1.src.rpm: build start
2026-Aug-06 16:44:43 :: [riscv64] #2200 openmvg-2.1.23-alt1.src.rpm: build OK
2026-Aug-06 16:44:43 :: [riscv64] #2300 opentoonz-1.8.0-alt1.src.rpm: build start
2026-Aug-06 17:18:51 :: [riscv64] #2300 opentoonz-1.8.0-alt1.src.rpm: build OK
2026-Aug-06 17:18:51 :: [riscv64] #2400 os-autoinst-4.6-alt27.git2d0c10da.src.rpm: build start
2026-Aug-06 17:20:26 :: [riscv64] #2400 os-autoinst-4.6-alt27.git2d0c10da.src.rpm: build SKIPPED
2026-Aug-06 17:20:26 :: [riscv64] #2500 postprocessd-0.3.0-alt2.src.rpm: build start
2026-Aug-06 17:24:56 :: [riscv64] #2500 postprocessd-0.3.0-alt2.src.rpm: build OK
2026-Aug-06 17:24:56 :: [riscv64] #2700 rtabmap-0.23.8-alt1.src.rpm: build start
2026-Aug-06 17:26:40 :: [riscv64] #2700 rtabmap-0.23.8-alt1.src.rpm: build SKIPPED
2026-Aug-06 17:26:40 :: [riscv64] #3000 sdrangel-7.27.1-alt1.src.rpm: build start
2026-Aug-06 17:28:37 :: [riscv64] #3000 sdrangel-7.27.1-alt1.src.rpm: build SKIPPED
2026-Aug-06 17:28:37 :: [riscv64] #3100 shotwell-0.32.17-alt1.src.rpm: build start
2026-Aug-06 17:38:43 :: [riscv64] #3100 shotwell-0.32.17-alt1.src.rpm: build OK
2026-Aug-06 17:38:43 :: [riscv64] #3200 simarrange-0.0-alt4.git0f1fbef.src.rpm: build start
2026-Aug-06 17:41:53 :: [riscv64] #3200 simarrange-0.0-alt4.git0f1fbef.src.rpm: build OK
2026-Aug-06 17:41:53 :: [riscv64] #3300 siril-1.4.3-alt1.src.rpm: build start
2026-Aug-06 17:56:02 :: [riscv64] #3300 siril-1.4.3-alt1.src.rpm: build OK
2026-Aug-06 17:56:02 :: [riscv64] #3400 spectacle-6.7.3-alt1.src.rpm: build start
2026-Aug-06 18:06:34 :: [riscv64] #3400 spectacle-6.7.3-alt1.src.rpm: build OK
2026-Aug-06 18:06:34 :: [riscv64] #3500 ueberzugpp-2.9.10-alt1.src.rpm: build start
2026-Aug-06 18:12:04 :: [riscv64] #3500 ueberzugpp-2.9.10-alt1.src.rpm: build OK
2026-Aug-06 18:12:04 :: [riscv64] #3600 libopencv4.13-4.13.0-alt2.src.rpm: build start
2026-Aug-06 20:07:00 :: [riscv64] #3600 libopencv4.13-4.13.0-alt2.src.rpm: build OK
2026-Aug-06 20:07:00 :: [riscv64] #3700 wl-kbptr-0.4.1-alt1.src.rpm: build start
2026-Aug-06 20:11:08 :: [riscv64] #3700 wl-kbptr-0.4.1-alt1.src.rpm: build OK
2026-Aug-06 20:11:09 :: [riscv64] #4000 xsnow-3.9.1-alt1.src.rpm: build start
2026-Aug-06 20:16:40 :: [riscv64] #4000 xsnow-3.9.1-alt1.src.rpm: build OK
2026-Aug-06 20:16:46 :: 100: build check OK
2026-Aug-06 20:16:47 :: 200: build check OK
2026-Aug-06 20:16:48 :: 300: build check OK
2026-Aug-06 20:16:48 :: #400: digikam-9.1.0-alt1.src.rpm: no source package
2026-Aug-06 20:16:50 :: 500: build check OK
2026-Aug-06 20:16:51 :: 600: build check OK
2026-Aug-06 20:16:51 :: 700: build check OK
2026-Aug-06 20:16:52 :: 1000: build check OK
2026-Aug-06 20:16:53 :: 1100: build check OK
2026-Aug-06 20:16:54 :: 1200: build check OK
find: 'riscv64/srpm/': No such file or directory
2026-Aug-06 20:16:55 :: 1500: build check OK
2026-Aug-06 20:16:55 :: #1600: mauikit-imagetools-4.0.2-alt1.src.rpm: no source package
2026-Aug-06 20:16:57 :: 1700: build check OK
2026-Aug-06 20:16:57 :: #2000: monado-25.1.0-alt4.src.rpm: no source package
riscv64/srpm/nomacs-3.22.1-alt1.src.rpm: license not found in '/usr/share/license' directory: CC-BY
riscv64/rpms/nomacs-plugins-3.22.1-alt1.riscv64.rpm: license not found in '/usr/share/license' directory: CC-BY
riscv64/rpms/nomacs-3.22.1-alt1.riscv64.rpm: license not found in '/usr/share/license' directory: CC-BY
riscv64/rpms/nomacs-debuginfo-3.22.1-alt1.riscv64.rpm: license not found in '/usr/share/license' directory: CC-BY
riscv64/rpms/nomacs-plugins-debuginfo-3.22.1-alt1.riscv64.rpm: license not found in '/usr/share/license' directory: CC-BY
2026-Aug-06 20:16:58 :: 2100: build check OK
2026-Aug-06 20:17:00 :: 2200: build check OK
2026-Aug-06 20:17:01 :: 2300: build check OK
2026-Aug-06 20:17:02 :: #2400: os-autoinst-4.6-alt27.git2d0c10da.src.rpm: no source package
2026-Aug-06 20:17:02 :: 2500: build check OK
2026-Aug-06 20:17:02 :: #2700: rtabmap-0.23.8-alt1.src.rpm: no source package
2026-Aug-06 20:17:03 :: #3000: sdrangel-7.27.1-alt1.src.rpm: no source package
2026-Aug-06 20:17:04 :: 3100: build check OK
riscv64/srpm/simarrange-0.0-alt4.git0f1fbef.src.rpm: license not found in '/usr/share/license' directory: AGPLv3+
riscv64/rpms/simarrange-debuginfo-0.0-alt4.git0f1fbef.riscv64.rpm: license not found in '/usr/share/license' directory: AGPLv3+
riscv64/rpms/simarrange-0.0-alt4.git0f1fbef.riscv64.rpm: license not found in '/usr/share/license' directory: AGPLv3+
2026-Aug-06 20:17:04 :: 3200: build check OK
riscv64/srpm/siril-1.4.3-alt1.src.rpm: license not found in '/usr/share/license' directory: Boost
riscv64/rpms/siril-1.4.3-alt1.riscv64.rpm: license not found in '/usr/share/license' directory: Boost
riscv64/rpms/siril-debuginfo-1.4.3-alt1.riscv64.rpm: license not found in '/usr/share/license' directory: Boost
2026-Aug-06 20:17:05 :: 3300: build check OK
2026-Aug-06 20:17:05 :: 3400: build check OK
2026-Aug-06 20:17:06 :: 3500: build check OK
2026-Aug-06 20:17:07 :: 3600: build check OK
2026-Aug-06 20:17:08 :: 3700: build check OK
2026-Aug-06 20:17:08 :: 4000: build check OK
2026-Aug-06 20:17:09 :: build check FAILED for: #400 #1400 #1600 #2000 #2400 #2700 #3000
2026-Aug-06 20:17:09 :: task #135022 for sisyphus_riscv64 FAILED
More information about the Riscv-reports
mailing list