[riscv-reports] [#134960] sisyphus_riscv64 FAILED del=gpgme
Girar sisyphus_riscv64 awaiter recycler
noreply at basealt.ru
Wed Aug 5 21:55:10 MSK 2026
http://web.build.srt.basealt.ru/tasks/134960/logs/events.1.1.log
2026-Aug-05 18:53:59 :: shared task #134960 for sisyphus_riscv64 started by recycler:
2026-Aug-05 18:53:59 :: message: sync
#100 delete gpgme
2026-Aug-05 18:54:06 :: build check OK
2026-Aug-05 18:54:07 :: build version check OK
2026-Aug-05 18:54:07 :: noarch check OK
2026-Aug-05 18:54:07 :: plan: src +0 -1 =21421, riscv64 +0 -7 =37814
2026-Aug-05 18:54:32 :: patched apt indices
2026-Aug-05 18:54:35 :: created next repo
2026-Aug-05 18:54:45 :: duplicate provides check OK
riscv64: NEW unmet dependencies detected:
kget#26.04.3-alt1:sisyphus_riscv64+133647.700.1.1 at 1785484092 libgpgmepp.so.6()(64bit) >= set:ni3tV2N4BPeqRTFQfnwwZKaxChEGTJi7hsyKeLWJ5mHlrYs4J9TC8u8fYVM
libkgetcore6#26.04.3-alt1:sisyphus_riscv64+133647.700.1.1 at 1785484092 libgpgmepp.so.6()(64bit) >= set:nj6fEAphWppnf0sZaXv6YugHm0HGxGrHXXj9B1A01qo4
libkgetcore6-debuginfo#26.04.3-alt1:sisyphus_riscv64+133647.700.1.1 at 1785484092 debug64(libgpgmepp.so.6)
libpoppler146#25.02.0-alt5:sisyphus_riscv64+95403.200.1.1 at 1758143382 libgpgmepp.so.6()(64bit) >= set:nh6Wi1s07Q03TOsS9dZjF9dwbQbXL6GFQLgcnZsRk1ReKqr7KtBLqbUgKlLwmeER8tYn7GKtrZyB5SmEweuXbTWdZL46DDHZ06zaZDxMZ0jRmWYYKglXq0IeY2xnPNoH1
libpoppler146-debuginfo#25.02.0-alt5:sisyphus_riscv64+95403.200.1.1 at 1758143382 debug64(libgpgmepp.so.6)
seahorse-nautilus#3.11.92-alt4.1:sisyphus_riscv64+133582.200.1.1 at 1785469133 libgpgme.so.11()(64bit) >= set:lgZfFXy6GmaCIsP5Hrt4hZh3KscsnWRDzsuDQLkVrQ8X3KABHAiCThAnZtWR8lVelrkdjPy7GYHnYR
seahorse-nautilus#3.11.92-alt4.1:sisyphus_riscv64+133582.200.1.1 at 1785469133 libgpgme.so.11(GPGME_1.0)(64bit)
seahorse-nautilus#3.11.92-alt4.1:sisyphus_riscv64+133582.200.1.1 at 1785469133 libgpgme.so.11(GPGME_1.1)(64bit)
seahorse-nautilus#3.11.92-alt4.1:sisyphus_riscv64+133582.200.1.1 at 1785469133 libgpgme.so.11(GPGME_1.2)(64bit)
seahorse-nautilus-debuginfo#3.11.92-alt4.1:sisyphus_riscv64+133582.200.1.1 at 1785469133 debug64(libgpgme.so.11)
sylpheed#3.7.0-alt0.8:sisyphus_riscv64+134895.100.1.1 at 1785937892 libgpgme >= 1.7.0
wget2#2.0.0-alt2:sisyphus_riscv64+67337.2400.1.1 at 1734310444 libgpgme.so.11()(64bit) >= set:lhQd5SupL1pXMhZiDNd3mltC8WooW
wget2#2.0.0-alt2:sisyphus_riscv64+67337.2400.1.1 at 1734310444 libgpgme.so.11(GPGME_1.0)(64bit)
wget2#2.0.0-alt2:sisyphus_riscv64+67337.2400.1.1 at 1734310444 libgpgme.so.11(GPGME_1.1)(64bit)
wget2#2.0.0-alt2:sisyphus_riscv64+67337.2400.1.1 at 1734310444 libgpgme.so.11(GPGME_1.2)(64bit)
wget2-debuginfo#2.0.0-alt2:sisyphus_riscv64+67337.2400.1.1 at 1734310444 debug64(libgpgme.so.11)
ACLs of affected packages (5):
kget
poppler146
seahorse-nautilus
sylpheed
wget2
2026-Aug-05 18:55:10 :: unmets: riscv64 +16 -0 =16
2026-Aug-05 18:55:10 :: dependencies check FAILED
2026-Aug-05 18:55:10 :: task #134960 for sisyphus_riscv64 FAILED
More information about the Riscv-reports
mailing list