[riscv-reports] [#134795] sisyphus_riscv64 FAILED srpm=libmozjs153-153.0-alt1.src.rpm

Girar sisyphus_riscv64 awaiter recycler noreply at basealt.ru
Wed Aug 5 12:06:12 MSK 2026


http://web.build.srt.basealt.ru/tasks/134795/logs/events.1.1.log

subtask  name         riscv64
   #100  libmozjs153   failed

2026-Aug-05 08:46:16 :: shared task #134795 for sisyphus_riscv64 started by recycler:
2026-Aug-05 08:46:16 :: message: sync
#100 build libmozjs153-153.0-alt1.src.rpm
2026-Aug-05 08:46:23 :: [riscv64] #100 libmozjs153-153.0-alt1.src.rpm: build start
[riscv64] /usr/src/.mozbuild/srcdirs/firefox-153.0-076fbf3c3461/_virtualenvs/build/bin/python -m mozbuild.action.check_binary --networking ../../../riscv64gc-unknown-linux-gnu/release/libjsrust.a
[riscv64] make[3]: Leaving directory '/usr/src/RPM/BUILD/firefox-153.0/_build/js/src/rust'
[riscv64] make[3]: Entering directory '/usr/src/RPM/BUILD/firefox-153.0/_build/js/src/rust'
[riscv64] js/src/rust/libjsrust.a
[riscv64] make[3]: Leaving directory '/usr/src/RPM/BUILD/firefox-153.0/_build/js/src/rust'
[riscv64] make[1]: *** [/usr/src/RPM/BUILD/firefox-153.0/config/recurse.mk:34: compile] Error 2
[riscv64] make: *** [/usr/src/RPM/BUILD/firefox-153.0/config/rules.mk:357: default] Error 2
[riscv64] error: Bad exit status from /usr/src/tmp/rpmb-tmp.h7gMbS (%build)
[riscv64] RPM build errors:
[riscv64]     Bad exit status from /usr/src/tmp/rpmb-tmp.h7gMbS (%build)
2026-Aug-05 09:06:12 :: [riscv64] libmozjs153-153.0-alt1.src.rpm: remote: build failed
2026-Aug-05 09:06:12 :: [riscv64] #100 libmozjs153-153.0-alt1.src.rpm: build FAILED
2026-Aug-05 09:06:12 :: [riscv64] requesting cancellation of task processing
2026-Aug-05 09:06:12 :: [riscv64] build FAILED
2026-Aug-05 09:06:12 :: task #134795 for sisyphus_riscv64 FAILED


More information about the Riscv-reports mailing list