[riscv-reports] [#134745] sisyphus_riscv64 FAILED (try 3) srpm=icu-7.8.3-alt1.src.rpm srpm=icu76-7.6.1-alt2.src.rpm ...

Girar sisyphus_riscv64 awaiter recycler noreply at basealt.ru
Wed Aug 5 08:06:10 MSK 2026


http://web.build.srt.basealt.ru/tasks/134745/logs/events.3.1.log

subtask  name             riscv64
  #1000  libwebkitgtk4.1   failed

2026-Aug-05 04:53:58 :: shared task #134745 for sisyphus_riscv64 resumed by recycler:
2026-Aug-05 04:53:58 :: message: sync
#100 build icu-7.8.3-alt1.src.rpm
#200 build icu76-7.6.1-alt2.src.rpm
#300 build libharfbuzz-14.2.1-alt1.src.rpm
#400 removed
#500 build libmozjs140-140.13.0-alt1.src.rpm
#600 build vte3-0.84.0-alt1.src.rpm
#700 build libical-3.0.20-alt1.src.rpm
#1000 build libwebkitgtk4.1-2.52.5-alt1.src.rpm
#1100 removed
#1200 build libphonenumber-9.0.35-alt1.2.src.rpm
#1300 build evolution-data-server-3.60.2-alt1.src.rpm
#1400 build tinysparql-3.11.1-alt1.src.rpm
#1500 build libwebkitgtk6.0-2.52.5-alt1.src.rpm
#1600 build libgedit-tepl-6.14.0-alt1.src.rpm
#1700 build localsearch-3.11.1-alt1.src.rpm
#2000 build libspelling-0.4.10-alt1.src.rpm
#2100 build gnome-builder-50.0-alt1.1.src.rpm
#2200 build darktable-5.6.0-alt1.src.rpm
#2300 build geary-46.0-alt1.1.src.rpm
#2400 build gnome-text-editor-50.1-alt1.src.rpm
#2500 build poedit-3.9.1-alt1.src.rpm
#2600 build python3-module-icu-2.16.2-alt1.src.rpm
#2700 build boost-1.91.0-alt3.src.rpm
#3000 build freerdp3-3.27.1-alt1.src.rpm
2026-Aug-05 04:53:58 :: created build repo
2026-Aug-05 04:54:05 :: [riscv64] #100 icu-7.8.3-alt1.src.rpm: build start
2026-Aug-05 04:54:09 :: [riscv64] #100 icu-7.8.3-alt1.src.rpm: build swiftly SKIPPED
2026-Aug-05 04:54:09 :: [riscv64] #200 icu76-7.6.1-alt2.src.rpm: build start
2026-Aug-05 04:54:13 :: [riscv64] #200 icu76-7.6.1-alt2.src.rpm: build swiftly SKIPPED
2026-Aug-05 04:54:13 :: [riscv64] #300 libharfbuzz-14.2.1-alt1.src.rpm: build start
2026-Aug-05 04:54:18 :: [riscv64] #300 libharfbuzz-14.2.1-alt1.src.rpm: build swiftly SKIPPED
2026-Aug-05 04:54:18 :: [riscv64] #500 libmozjs140-140.13.0-alt1.src.rpm: build start
2026-Aug-05 04:54:53 :: [riscv64] #500 libmozjs140-140.13.0-alt1.src.rpm: build swiftly SKIPPED
2026-Aug-05 04:54:53 :: [riscv64] #600 vte3-0.84.0-alt1.src.rpm: build start
2026-Aug-05 04:54:57 :: [riscv64] #600 vte3-0.84.0-alt1.src.rpm: build swiftly SKIPPED
2026-Aug-05 04:54:57 :: [riscv64] #700 libical-3.0.20-alt1.src.rpm: build start
2026-Aug-05 04:54:59 :: [riscv64] #700 libical-3.0.20-alt1.src.rpm: build swiftly SKIPPED
2026-Aug-05 04:54:59 :: [riscv64] #1000 libwebkitgtk4.1-2.52.5-alt1.src.rpm: build start
[riscv64] [2267/9431] /usr/bin/ccache /usr/bin/clang++ -DBUILDING_GTK__=1 -DBUILDING_LLIntSettingsExtractor -DBUILDING_WEBKIT=1 -DBUILDING_WITH_CMAKE=1 -DBWRAP_EXECUTABLE=\"/usr/bin/bwrap\" -DDBUS_PROXY_EXECUTABLE=\"/usr/bin/xdg-dbus-proxy\" -DGETTEXT_PACKAGE=\"WebKitGTK-4.1\" -DHAVE_CONFIG_H=1 -DJSC_GLIB_API_ENABLED -DPAS_BMALLOC=1 -DUSER_AGENT_BRANDING=\"ALTLinux\" -D_GLIBCXX_ASSERTIONS=1 -I/usr/src/RPM/BUILD/webkitgtk-2.52.5/riscv64-alt-linux/JavaScriptCore/Headers -I/usr/src/RPM/BUILD/webkitgtk-2.52.5/riscv64-alt-linux/JavaScriptCore/PrivateHeaders -I/usr/src/RPM/BUILD/webkitgtk-2.52.5/riscv64-alt-linux -I/usr/src/RPM/BUILD/webkitgtk-2.52.5/riscv64-alt-linux/JavaScriptCore/PrivateHeaders/JavaScriptCore -I/usr/src/RPM/BUILD/webkitgtk-2.52.5/Source/JavaScriptCore -I/usr/src/RPM/BUILD/webkitgtk-2.52.5/Source/JavaScriptCore/API -I/usr/src/RPM/BUILD/webkitgtk-2.52.5/Source/JavaScriptCore/assembler -I/usr/src/RPM/BUILD/webkitgtk-2.52.5/Source/JavaScriptCore/b3 -I/usr/src/RPM/BUILD/webk
 itgtk-2.52.5/Source/JavaScriptCore/b3/air -I/usr/src/RPM/BUILD/webkitgtk-2.52.5/Source/JavaScriptCore/bindings -I/usr/src/RPM/BUILD/webkitgtk-2.52.5/Source/JavaScriptCore/builtins -I/usr/src/RPM/BUILD/webkitgtk-2.52.5/Source/JavaScriptCore/bytecode -I/usr/src/RPM/BUILD/webkitgtk-2.52.5/Source/JavaScriptCore/bytecompiler -I/usr/src/RPM/BUILD/webkitgtk-2.52.5/Source/JavaScriptCore/dfg -I/usr/src/RPM/BUILD/webkitgtk-2.52.5/Source/JavaScriptCore/disassembler -I/usr/src/RPM/BUILD/webkitgtk-2.52.5/Source/JavaScriptCore/disassembler/ARM64 -I/usr/src/RPM/BUILD/webkitgtk-2.52.5/Source/JavaScriptCore/disassembler/zydis -I/usr/src/RPM/BUILD/webkitgtk-2.52.5/Source/JavaScriptCore/domjit -I/usr/src/RPM/BUILD/webkitgtk-2.52.5/Source/JavaScriptCore/ftl -I/usr/src/RPM/BUILD/webkitgtk-2.52.5/Source/JavaScriptCore/fuzzilli -I/usr/src/RPM/BUILD/webkitgtk-2.52.5/Source/JavaScriptCore/heap -I/usr/src/RPM/BUILD/webkitgtk-2.52.5/Source/JavaScriptCore/debugger -I/usr/src/RPM/BUILD/webkitgtk-2.52.5/Source/J
 avaScriptCore/inspector -I/usr/src/RPM/BUILD/webkitgtk-2.52.5/Source/JavaScriptCore/inspector/agents -I/usr/src/RPM/BUILD/webkitgtk-2.52.5/Source/JavaScriptCore/inspector/augmentable -I/usr/src/RPM/BUILD/webkitgtk-2.52.5/Source/JavaScriptCore/inspector/remote -I/usr/src/RPM/BUILD/webkitgtk-2.52.5/Source/JavaScriptCore/interpreter -I/usr/src/RPM/BUILD/webkitgtk-2.52.5/Source/JavaScriptCore/jit -I/usr/src/RPM/BUILD/webkitgtk-2.52.5/Source/JavaScriptCore/llint -I/usr/src/RPM/BUILD/webkitgtk-2.52.5/Source/JavaScriptCore/parser -I/usr/src/RPM/BUILD/webkitgtk-2.52.5/Source/JavaScriptCore/profiler -I/usr/src/RPM/BUILD/webkitgtk-2.52.5/Source/JavaScriptCore/runtime -I/usr/src/RPM/BUILD/webkitgtk-2.52.5/Source/JavaScriptCore/tools -I/usr/src/RPM/BUILD/webkitgtk-2.52.5/Source/JavaScriptCore/wasm -I/usr/src/RPM/BUILD/webkitgtk-2.52.5/Source/JavaScriptCore/wasm/debugger -I/usr/src/RPM/BUILD/webkitgtk-2.52.5/Source/JavaScriptCore/wasm/js -I/usr/src/RPM/BUILD/webkitgtk-2.52.5/Source/JavaScriptCor
 e/yarr -I/usr/src/RPM/BUILD/webkitgtk-2.52.5/riscv64-alt-linux/JavaScriptCore/DerivedSources -I/usr/src/RPM/BUILD/webkitgtk-2.52.5/riscv64-alt-linux/JavaScriptCore/DerivedSources/inspector -I/usr/src/RPM/BUILD/webkitgtk-2.52.5/riscv64-alt-linux/JavaScriptCore/DerivedSources/runtime -I/usr/src/RPM/BUILD/webkitgtk-2.52.5/riscv64-alt-linux/JavaScriptCore/DerivedSources/yarr -I/usr/src/RPM/BUILD/webkitgtk-2.52.5/Source/JavaScriptCore/API/glib -I/usr/src/RPM/BUILD/webkitgtk-2.52.5/riscv64-alt-linux/JavaScriptCoreGLib/DerivedSources -I/usr/src/RPM/BUILD/webkitgtk-2.52.5/riscv64-alt-linux/JavaScriptCoreGLib/DerivedSources/jsc -I/usr/src/RPM/BUILD/webkitgtk-2.52.5/riscv64-alt-linux/JavaScriptCoreGLib/Headers -I/usr/src/RPM/BUILD/webkitgtk-2.52.5/Source/JavaScriptCore/inspector/remote/glib -I/usr/src/RPM/BUILD/webkitgtk-2.52.5/riscv64-alt-linux/WTF/Headers -I/usr/include/glib-2.0 -I/usr/lib64/glib-2.0/include -I/usr/include/sysprof-6 -I/usr/src/RPM/BUILD/webkitgtk-2.52.5/riscv64-alt-linux/bm
 alloc/Headers -fdiagnostics-color=always -fcolor-diagnostics -Wextra -Wall -Wno-character-conversion -Werror=undefined-internal -Werror=undefined-inline -pipe -Wno-noexcept-type -Wno-nullability-completeness -Wno-psabi -Wno-misleading-indentation -Wno-parentheses-equality -Wundef -Wpointer-arith -Wmissing-format-attribute -Wformat-security -Wcast-align -Wno-tautological-compare -fasynchronous-unwind-tables -fdebug-types-section -pipe -frecord-gcc-switches -Wall -g1 -O2  -Wl,--no-keep-memory  -Wno-error=return-type -fno-strict-aliasing -fno-exceptions -fno-rtti -fcoroutines -ffunction-sections -fdata-sections -O2 -DNDEBUG -std=c++23 -fPIE -fvisibility=hidden -MD -MT Source/JavaScriptCore/CMakeFiles/LLIntSettingsExtractor.dir/llint/LLIntSettingsExtractor.cpp.o -MF Source/JavaScriptCore/CMakeFiles/LLIntSettingsExtractor.dir/llint/LLIntSettingsExtractor.cpp.o.d -o Source/JavaScriptCore/CMakeFiles/LLIntSettingsExtractor.dir/llint/LLIntSettingsExtractor.cpp.o -c /usr/src/RPM/BUILD/webkitg
 tk-2.52.5/Source/JavaScriptCore/llint/LLIntSettingsExtractor.cpp
[riscv64] FAILED: [code=1] Source/JavaScriptCore/CMakeFiles/LLIntSettingsExtractor.dir/llint/LLIntSettingsExtractor.cpp.o 
[riscv64] /usr/bin/ccache /usr/bin/clang++ -DBUILDING_GTK__=1 -DBUILDING_LLIntSettingsExtractor -DBUILDING_WEBKIT=1 -DBUILDING_WITH_CMAKE=1 -DBWRAP_EXECUTABLE=\"/usr/bin/bwrap\" -DDBUS_PROXY_EXECUTABLE=\"/usr/bin/xdg-dbus-proxy\" -DGETTEXT_PACKAGE=\"WebKitGTK-4.1\" -DHAVE_CONFIG_H=1 -DJSC_GLIB_API_ENABLED -DPAS_BMALLOC=1 -DUSER_AGENT_BRANDING=\"ALTLinux\" -D_GLIBCXX_ASSERTIONS=1 -I/usr/src/RPM/BUILD/webkitgtk-2.52.5/riscv64-alt-linux/JavaScriptCore/Headers -I/usr/src/RPM/BUILD/webkitgtk-2.52.5/riscv64-alt-linux/JavaScriptCore/PrivateHeaders -I/usr/src/RPM/BUILD/webkitgtk-2.52.5/riscv64-alt-linux -I/usr/src/RPM/BUILD/webkitgtk-2.52.5/riscv64-alt-linux/JavaScriptCore/PrivateHeaders/JavaScriptCore -I/usr/src/RPM/BUILD/webkitgtk-2.52.5/Source/JavaScriptCore -I/usr/src/RPM/BUILD/webkitgtk-2.52.5/Source/JavaScriptCore/API -I/usr/src/RPM/BUILD/webkitgtk-2.52.5/Source/JavaScriptCore/assembler -I/usr/src/RPM/BUILD/webkitgtk-2.52.5/Source/JavaScriptCore/b3 -I/usr/src/RPM/BUILD/webkitgtk-2.52.5
 /Source/JavaScriptCore/b3/air -I/usr/src/RPM/BUILD/webkitgtk-2.52.5/Source/JavaScriptCore/bindings -I/usr/src/RPM/BUILD/webkitgtk-2.52.5/Source/JavaScriptCore/builtins -I/usr/src/RPM/BUILD/webkitgtk-2.52.5/Source/JavaScriptCore/bytecode -I/usr/src/RPM/BUILD/webkitgtk-2.52.5/Source/JavaScriptCore/bytecompiler -I/usr/src/RPM/BUILD/webkitgtk-2.52.5/Source/JavaScriptCore/dfg -I/usr/src/RPM/BUILD/webkitgtk-2.52.5/Source/JavaScriptCore/disassembler -I/usr/src/RPM/BUILD/webkitgtk-2.52.5/Source/JavaScriptCore/disassembler/ARM64 -I/usr/src/RPM/BUILD/webkitgtk-2.52.5/Source/JavaScriptCore/disassembler/zydis -I/usr/src/RPM/BUILD/webkitgtk-2.52.5/Source/JavaScriptCore/domjit -I/usr/src/RPM/BUILD/webkitgtk-2.52.5/Source/JavaScriptCore/ftl -I/usr/src/RPM/BUILD/webkitgtk-2.52.5/Source/JavaScriptCore/fuzzilli -I/usr/src/RPM/BUILD/webkitgtk-2.52.5/Source/JavaScriptCore/heap -I/usr/src/RPM/BUILD/webkitgtk-2.52.5/Source/JavaScriptCore/debugger -I/usr/src/RPM/BUILD/webkitgtk-2.52.5/Source/JavaScriptCor
 e/inspector -I/usr/src/RPM/BUILD/webkitgtk-2.52.5/Source/JavaScriptCore/inspector/agents -I/usr/src/RPM/BUILD/webkitgtk-2.52.5/Source/JavaScriptCore/inspector/augmentable -I/usr/src/RPM/BUILD/webkitgtk-2.52.5/Source/JavaScriptCore/inspector/remote -I/usr/src/RPM/BUILD/webkitgtk-2.52.5/Source/JavaScriptCore/interpreter -I/usr/src/RPM/BUILD/webkitgtk-2.52.5/Source/JavaScriptCore/jit -I/usr/src/RPM/BUILD/webkitgtk-2.52.5/Source/JavaScriptCore/llint -I/usr/src/RPM/BUILD/webkitgtk-2.52.5/Source/JavaScriptCore/parser -I/usr/src/RPM/BUILD/webkitgtk-2.52.5/Source/JavaScriptCore/profiler -I/usr/src/RPM/BUILD/webkitgtk-2.52.5/Source/JavaScriptCore/runtime -I/usr/src/RPM/BUILD/webkitgtk-2.52.5/Source/JavaScriptCore/tools -I/usr/src/RPM/BUILD/webkitgtk-2.52.5/Source/JavaScriptCore/wasm -I/usr/src/RPM/BUILD/webkitgtk-2.52.5/Source/JavaScriptCore/wasm/debugger -I/usr/src/RPM/BUILD/webkitgtk-2.52.5/Source/JavaScriptCore/wasm/js -I/usr/src/RPM/BUILD/webkitgtk-2.52.5/Source/JavaScriptCore/yarr -I/us
 r/src/RPM/BUILD/webkitgtk-2.52.5/riscv64-alt-linux/JavaScriptCore/DerivedSources -I/usr/src/RPM/BUILD/webkitgtk-2.52.5/riscv64-alt-linux/JavaScriptCore/DerivedSources/inspector -I/usr/src/RPM/BUILD/webkitgtk-2.52.5/riscv64-alt-linux/JavaScriptCore/DerivedSources/runtime -I/usr/src/RPM/BUILD/webkitgtk-2.52.5/riscv64-alt-linux/JavaScriptCore/DerivedSources/yarr -I/usr/src/RPM/BUILD/webkitgtk-2.52.5/Source/JavaScriptCore/API/glib -I/usr/src/RPM/BUILD/webkitgtk-2.52.5/riscv64-alt-linux/JavaScriptCoreGLib/DerivedSources -I/usr/src/RPM/BUILD/webkitgtk-2.52.5/riscv64-alt-linux/JavaScriptCoreGLib/DerivedSources/jsc -I/usr/src/RPM/BUILD/webkitgtk-2.52.5/riscv64-alt-linux/JavaScriptCoreGLib/Headers -I/usr/src/RPM/BUILD/webkitgtk-2.52.5/Source/JavaScriptCore/inspector/remote/glib -I/usr/src/RPM/BUILD/webkitgtk-2.52.5/riscv64-alt-linux/WTF/Headers -I/usr/include/glib-2.0 -I/usr/lib64/glib-2.0/include -I/usr/include/sysprof-6 -I/usr/src/RPM/BUILD/webkitgtk-2.52.5/riscv64-alt-linux/bmalloc/Header
 s -fdiagnostics-color=always -fcolor-diagnostics -Wextra -Wall -Wno-character-conversion -Werror=undefined-internal -Werror=undefined-inline -pipe -Wno-noexcept-type -Wno-nullability-completeness -Wno-psabi -Wno-misleading-indentation -Wno-parentheses-equality -Wundef -Wpointer-arith -Wmissing-format-attribute -Wformat-security -Wcast-align -Wno-tautological-compare -fasynchronous-unwind-tables -fdebug-types-section -pipe -frecord-gcc-switches -Wall -g1 -O2  -Wl,--no-keep-memory  -Wno-error=return-type -fno-strict-aliasing -fno-exceptions -fno-rtti -fcoroutines -ffunction-sections -fdata-sections -O2 -DNDEBUG -std=c++23 -fPIE -fvisibility=hidden -MD -MT Source/JavaScriptCore/CMakeFiles/LLIntSettingsExtractor.dir/llint/LLIntSettingsExtractor.cpp.o -MF Source/JavaScriptCore/CMakeFiles/LLIntSettingsExtractor.dir/llint/LLIntSettingsExtractor.cpp.o.d -o Source/JavaScriptCore/CMakeFiles/LLIntSettingsExtractor.dir/llint/LLIntSettingsExtractor.cpp.o -c /usr/src/RPM/BUILD/webkitgtk-2.52.5/So
 urce/JavaScriptCore/llint/LLIntSettingsExtractor.cpp
[riscv64] --
[riscv64] In file included from /usr/src/RPM/BUILD/webkitgtk-2.52.5/riscv64-alt-linux/JavaScriptCore/PrivateHeaders/JavaScriptCore/MacroAssembler.h:54:
[riscv64] /usr/src/RPM/BUILD/webkitgtk-2.52.5/Source/JavaScriptCore/assembler/MacroAssemblerRISCV64.h:4368:41: error: no template named 'EnableIfInteger'
[riscv64]  4368 |         template<typename T, typename = EnableIfInteger<T>>
[riscv64] /usr/src/RPM/BUILD/webkitgtk-2.52.5/Source/JavaScriptCore/assembler/MacroAssemblerRISCV64.h:4375:41: error: no template named 'EnableIfInteger'
[riscv64]  4375 |         template<typename T, typename = EnableIfInteger<T>>
[riscv64] /usr/src/RPM/BUILD/webkitgtk-2.52.5/Source/JavaScriptCore/assembler/MacroAssemblerRISCV64.h:4381:41: error: no template named 'EnableIfInteger'
[riscv64]  4381 |         template<typename T, typename = EnableIfInteger<T>>
[riscv64] /usr/src/RPM/BUILD/webkitgtk-2.52.5/Source/JavaScriptCore/assembler/MacroAssemblerRISCV64.h:228:62: error: no matching function for call to 'S'
[riscv64]   228 |             m_assembler.swInsn(resolution.base, temp.data(), Imm::S(resolution.offset));
[riscv64] --
[riscv64]  4374 |         static SType S() { return SType::v<SType, value>(); }
[riscv64] /usr/src/RPM/BUILD/webkitgtk-2.52.5/Source/JavaScriptCore/assembler/MacroAssemblerRISCV64.h:237:58: error: no matching function for call to 'S'
[riscv64]   237 |         m_assembler.swInsn(resolution.base, temp.data(), Imm::S(resolution.offset));
[riscv64] --
[riscv64]  4374 |         static SType S() { return SType::v<SType, value>(); }
[riscv64] /usr/src/RPM/BUILD/webkitgtk-2.52.5/Source/JavaScriptCore/assembler/MacroAssemblerRISCV64.h:321:62: error: no matching function for call to 'S'
[riscv64]   321 |             m_assembler.sdInsn(resolution.base, temp.data(), Imm::S(resolution.offset));
[riscv64] --
[riscv64]  4374 |         static SType S() { return SType::v<SType, value>(); }
[riscv64] /usr/src/RPM/BUILD/webkitgtk-2.52.5/Source/JavaScriptCore/assembler/MacroAssemblerRISCV64.h:329:58: error: no matching function for call to 'S'
[riscv64]   329 |         m_assembler.sdInsn(resolution.base, temp.data(), Imm::S(resolution.offset));
[riscv64] --
[riscv64]  4374 |         static SType S() { return SType::v<SType, value>(); }
[riscv64] /usr/src/RPM/BUILD/webkitgtk-2.52.5/Source/JavaScriptCore/assembler/MacroAssemblerRISCV64.h:397:62: error: no matching function for call to 'S'
[riscv64]   397 |             m_assembler.swInsn(resolution.base, temp.data(), Imm::S(resolution.offset));
[riscv64] --
[riscv64]  4374 |         static SType S() { return SType::v<SType, value>(); }
[riscv64] /usr/src/RPM/BUILD/webkitgtk-2.52.5/Source/JavaScriptCore/assembler/MacroAssemblerRISCV64.h:405:58: error: no matching function for call to 'S'
[riscv64]   405 |         m_assembler.swInsn(resolution.base, temp.data(), Imm::S(resolution.offset));
2026-Aug-05 05:06:09 :: [riscv64] libwebkitgtk4.1-2.52.5-alt1.src.rpm: remote: build failed
2026-Aug-05 05:06:09 :: [riscv64] #1000 libwebkitgtk4.1-2.52.5-alt1.src.rpm: build FAILED
2026-Aug-05 05:06:09 :: [riscv64] requesting cancellation of task processing
2026-Aug-05 05:06:10 :: [riscv64] build FAILED
2026-Aug-05 05:06:10 :: task #134745 for sisyphus_riscv64 FAILED


More information about the Riscv-reports mailing list