[riscv-reports] [#134487] sisyphus_riscv64 FAILED srpm=displaylink-driver-6.3.0-alt1.48.src.rpm

Girar sisyphus_riscv64 awaiter recycler noreply at basealt.ru
Tue Aug 4 04:50:50 MSK 2026


http://web.build.srt.basealt.ru/tasks/134487/logs/events.1.1.log

2026-Aug-04 01:49:41 :: shared task #134487 for sisyphus_riscv64 started by recycler:
2026-Aug-04 01:49:41 :: message: sync
#100 build displaylink-driver-6.3.0-alt1.48.src.rpm
2026-Aug-04 01:49:48 :: [riscv64] #100 displaylink-driver-6.3.0-alt1.48.src.rpm: build start
2026-Aug-04 01:50:50 :: [riscv64] #100 displaylink-driver-6.3.0-alt1.48.src.rpm: build SKIPPED
2026-Aug-04 01:50:50 :: #100: displaylink-driver-6.3.0-alt1.48.src.rpm: no source package
2026-Aug-04 01:50:50 :: build check FAILED for: #100 
2026-Aug-04 01:50:50 :: task #134487 for sisyphus_riscv64 FAILED


More information about the Riscv-reports mailing list