[riscv-reports] [#134351] sisyphus_riscv64 FAILED srpm=manticore-17.5.1-alt1.src.rpm

Girar sisyphus_riscv64 awaiter recycler noreply at basealt.ru
Mon Aug 3 20:45:33 MSK 2026


http://web.build.srt.basealt.ru/tasks/134351/logs/events.1.1.log

2026-Aug-03 17:44:20 :: shared task #134351 for sisyphus_riscv64 started by recycler:
2026-Aug-03 17:44:20 :: message: sync
#100 build manticore-17.5.1-alt1.src.rpm
2026-Aug-03 17:44:26 :: [riscv64] #100 manticore-17.5.1-alt1.src.rpm: build start
2026-Aug-03 17:45:32 :: [riscv64] #100 manticore-17.5.1-alt1.src.rpm: build SKIPPED
2026-Aug-03 17:45:33 :: #100: manticore-17.5.1-alt1.src.rpm: no source package
2026-Aug-03 17:45:33 :: build check FAILED for: #100 
2026-Aug-03 17:45:33 :: task #134351 for sisyphus_riscv64 FAILED


More information about the Riscv-reports mailing list