[riscv-reports] [#134335] sisyphus_riscv64 FAILED (try 2) srpm=superfile-1.6.0-alt1.src.rpm

Girar sisyphus_riscv64 awaiter recycler noreply at basealt.ru
Mon Aug 3 19:34:25 MSK 2026


http://web.build.srt.basealt.ru/tasks/134335/logs/events.2.1.log

subtask  name       riscv64
   #100  superfile   failed

2026-Aug-03 16:28:46 :: shared task #134335 for sisyphus_riscv64 resumed by recycler:
2026-Aug-03 16:28:46 :: message: sync
#100 build superfile-1.6.0-alt1.src.rpm
2026-Aug-03 16:28:52 :: [riscv64] #100 superfile-1.6.0-alt1.src.rpm: build start
[riscv64] ?   	github.com/yorukot/superfile/src/internal/ui/filemodel	[no test files]
[riscv64] --- FAIL: TestReturnDirElement (0.08s)
[riscv64]     --- FAIL: TestReturnDirElement/Sort_by_Date (0.00s)
[riscv64]         get_elements_test.go:217: 
[riscv64]             	Error Trace:	/usr/src/RPM/BUILD/superfile-1.6.0/.gopath/src/github.com/yorukot/superfile/src/internal/ui/filepanel/get_elements_test.go:217
[riscv64]             	Error:      	Not equal: 
[riscv64]             	            	expected: []string{"dirNatural", "1.json", "file2.txt", "abc", "xyz.json", "file1.txt", "aBcD", "dir1", "dir2"}
2026-Aug-03 16:34:24 :: [riscv64] superfile-1.6.0-alt1.src.rpm: remote: build failed
2026-Aug-03 16:34:24 :: [riscv64] #100 superfile-1.6.0-alt1.src.rpm: build FAILED
2026-Aug-03 16:34:24 :: [riscv64] requesting cancellation of task processing
2026-Aug-03 16:34:24 :: [riscv64] build FAILED
2026-Aug-03 16:34:24 :: task #134335 for sisyphus_riscv64 FAILED


More information about the Riscv-reports mailing list