[riscv-reports] [#134261] sisyphus_riscv64 FAILED srpm=gnome-shell-extension-hanabi-20260724-alt1.src.rpm
Girar sisyphus_riscv64 awaiter recycler
noreply at basealt.ru
Mon Aug 3 15:57:59 MSK 2026
http://web.build.srt.basealt.ru/tasks/134261/logs/events.1.1.log
subtask name riscv64
#100 gnome-shell-extension-hanabi failed
2026-Aug-03 12:55:20 :: shared task #134261 for sisyphus_riscv64 started by recycler:
2026-Aug-03 12:55:20 :: message: sync
#100 build gnome-shell-extension-hanabi-20260724-alt1.src.rpm
2026-Aug-03 12:55:26 :: [riscv64] #100 gnome-shell-extension-hanabi-20260724-alt1.src.rpm: build start
[riscv64] at defaultResolve (node:internal/modules/esm/resolve:985:11)
[riscv64] at #cachedDefaultResolve (node:internal/modules/esm/loader:747:20)
[riscv64] at ModuleLoader.resolve (node:internal/modules/esm/loader:724:38)
[riscv64] at ModuleLoader.getModuleJobForImport (node:internal/modules/esm/loader:320:38)
[riscv64] at ModuleJob._link (node:internal/modules/esm/module_job:182:49) {
[riscv64] code: 'ERR_MODULE_NOT_FOUND'
[riscv64] Node.js v22.23.1
[riscv64] error: Bad exit status from /usr/src/tmp/rpmb-tmp.4WjrM5 (%build)
[riscv64] RPM build errors:
[riscv64] Bad exit status from /usr/src/tmp/rpmb-tmp.4WjrM5 (%build)
2026-Aug-03 12:57:58 :: [riscv64] gnome-shell-extension-hanabi-20260724-alt1.src.rpm: remote: build failed
2026-Aug-03 12:57:58 :: [riscv64] #100 gnome-shell-extension-hanabi-20260724-alt1.src.rpm: build FAILED
2026-Aug-03 12:57:58 :: [riscv64] requesting cancellation of task processing
2026-Aug-03 12:57:59 :: [riscv64] build FAILED
2026-Aug-03 12:57:59 :: task #134261 for sisyphus_riscv64 FAILED
More information about the Riscv-reports
mailing list