[riscv-reports] [#134253] sisyphus_riscv64 FAILED srpm=openqa-4.6-alt32.git73674c429.src.rpm
Girar sisyphus_riscv64 awaiter recycler
noreply at basealt.ru
Mon Aug 3 14:46:49 MSK 2026
http://web.build.srt.basealt.ru/tasks/134253/logs/events.1.1.log
2026-Aug-03 11:45:04 :: shared task #134253 for sisyphus_riscv64 started by recycler:
2026-Aug-03 11:45:04 :: message: sync
#100 build openqa-4.6-alt32.git73674c429.src.rpm
2026-Aug-03 11:45:07 :: [riscv64] #100 openqa-4.6-alt32.git73674c429.src.rpm: build start
2026-Aug-03 11:46:48 :: [riscv64] #100 openqa-4.6-alt32.git73674c429.src.rpm: build SKIPPED
2026-Aug-03 11:46:48 :: #100: openqa-4.6-alt32.git73674c429.src.rpm: no source package
2026-Aug-03 11:46:49 :: build check FAILED for: #100
2026-Aug-03 11:46:49 :: task #134253 for sisyphus_riscv64 FAILED
More information about the Riscv-reports
mailing list