[riscv-reports] [#134102] sisyphus_riscv64 FAILED srpm=klevernotes-1.3.1-alt4.src.rpm

Girar sisyphus_riscv64 awaiter recycler noreply at basealt.ru
Sun Aug 2 11:13:56 MSK 2026


http://web.build.srt.basealt.ru/tasks/134102/logs/events.1.1.log

2026-Aug-02 08:12:46 :: shared task #134102 for sisyphus_riscv64 started by recycler:
2026-Aug-02 08:12:46 :: message: sync
#100 build klevernotes-1.3.1-alt4.src.rpm
2026-Aug-02 08:12:52 :: [riscv64] #100 klevernotes-1.3.1-alt4.src.rpm: build start
2026-Aug-02 08:13:56 :: [riscv64] #100 klevernotes-1.3.1-alt4.src.rpm: build SKIPPED
2026-Aug-02 08:13:56 :: #100: klevernotes-1.3.1-alt4.src.rpm: no source package
2026-Aug-02 08:13:56 :: build check FAILED for: #100 
2026-Aug-02 08:13:56 :: task #134102 for sisyphus_riscv64 FAILED


More information about the Riscv-reports mailing list