[riscv-reports] [#119898] sisyphus_riscv64 FAILED srpm=yaksa-0.4-alt1.src.rpm srpm=ucx-1.20.0-alt1.src.rpm ...

Girar sisyphus_riscv64 awaiter recycler noreply at basealt.ru
Wed Apr 22 09:56:34 MSK 2026


http://web.build.srt.basealt.ru/tasks/119898/logs/events.1.1.log

subtask  name        riscv64
   #100  yaksa          5:44
   #200  ucx           13:04
   #300  libfabric      5:19
   #400  mpich         28:06
   #500  qbs           15:34
   #600  lazysql        5:15
   #700  lazydocker     4:05
  #1000  nchat        failed

2026-Apr-22 05:23:52 :: shared task #119898 for sisyphus_riscv64 started by recycler:
2026-Apr-22 05:23:52 :: message: sync
#100 build yaksa-0.4-alt1.src.rpm
#200 build ucx-1.20.0-alt1.src.rpm
#300 build libfabric-2.5.1-alt1.src.rpm
#400 build mpich-5.0.1-alt1.src.rpm
#500 build qbs-3.2.0-alt1.src.rpm
#600 build lazysql-0.4.8-alt1.src.rpm
#700 build lazydocker-0.25.2-alt1.src.rpm
#1000 build nchat-5.14.44-alt1.src.rpm
#1100 build peco-0.6.0-alt1.src.rpm
2026-Apr-22 05:23:52 :: created build repo
2026-Apr-22 05:23:57 :: [riscv64] #100 yaksa-0.4-alt1.src.rpm: build start
2026-Apr-22 05:29:41 :: [riscv64] #100 yaksa-0.4-alt1.src.rpm: build OK
2026-Apr-22 05:29:41 :: [riscv64] #200 ucx-1.20.0-alt1.src.rpm: build start
2026-Apr-22 05:42:45 :: [riscv64] #200 ucx-1.20.0-alt1.src.rpm: build OK
2026-Apr-22 05:42:45 :: [riscv64] #300 libfabric-2.5.1-alt1.src.rpm: build start
2026-Apr-22 05:48:04 :: [riscv64] #300 libfabric-2.5.1-alt1.src.rpm: build OK
2026-Apr-22 05:48:04 :: [riscv64] #400 mpich-5.0.1-alt1.src.rpm: build start
2026-Apr-22 06:16:10 :: [riscv64] #400 mpich-5.0.1-alt1.src.rpm: build OK
2026-Apr-22 06:16:10 :: [riscv64] #500 qbs-3.2.0-alt1.src.rpm: build start
2026-Apr-22 06:31:44 :: [riscv64] #500 qbs-3.2.0-alt1.src.rpm: build OK
2026-Apr-22 06:31:44 :: [riscv64] #600 lazysql-0.4.8-alt1.src.rpm: build start
2026-Apr-22 06:36:59 :: [riscv64] #600 lazysql-0.4.8-alt1.src.rpm: build OK
2026-Apr-22 06:36:59 :: [riscv64] #700 lazydocker-0.25.2-alt1.src.rpm: build start
2026-Apr-22 06:41:04 :: [riscv64] #700 lazydocker-0.25.2-alt1.src.rpm: build OK
2026-Apr-22 06:41:04 :: [riscv64] #1000 nchat-5.14.44-alt1.src.rpm: build start
[riscv64] [645/650] : && /usr/bin/c++ -fPIC -pipe -frecord-gcc-switches -Wall -g -O2 -flto=auto -O2 -DNDEBUG  -shared -Wl,--dependency-file=lib/wmchat/CMakeFiles/wmchat.dir/link.d -Wl,-soname,libwmchat.so -o usr/lib64/libwmchat.so lib/wmchat/CMakeFiles/wmchat.dir/src/wmchat.cpp.o -L/usr/src/RPM/BUILD/nchat-5.14.44/riscv64-alt-linux/lib/wmchat/go -Wl,-rpath,/usr/src/RPM/BUILD/nchat-5.14.44/riscv64-alt-linux/lib/wmchat/go:/usr/src/RPM/BUILD/nchat-5.14.44/riscv64-alt-linux/usr/lib64:  -lcgowm  usr/lib64/libncutil.so  /usr/lib64/libmagic.so  /usr/lib64/libsqlite3.so  usr/lib64/libclip.a  usr/lib64/libqrcodegen.a  usr/lib64/libstb.a && :
[riscv64] FAILED: [code=1] usr/lib64/libwmchat.so 
[riscv64] : && /usr/bin/c++ -fPIC -pipe -frecord-gcc-switches -Wall -g -O2 -flto=auto -O2 -DNDEBUG  -shared -Wl,--dependency-file=lib/wmchat/CMakeFiles/wmchat.dir/link.d -Wl,-soname,libwmchat.so -o usr/lib64/libwmchat.so lib/wmchat/CMakeFiles/wmchat.dir/src/wmchat.cpp.o -L/usr/src/RPM/BUILD/nchat-5.14.44/riscv64-alt-linux/lib/wmchat/go -Wl,-rpath,/usr/src/RPM/BUILD/nchat-5.14.44/riscv64-alt-linux/lib/wmchat/go:/usr/src/RPM/BUILD/nchat-5.14.44/riscv64-alt-linux/usr/lib64:  -lcgowm  usr/lib64/libncutil.so  /usr/lib64/libmagic.so  /usr/lib64/libsqlite3.so  usr/lib64/libclip.a  usr/lib64/libqrcodegen.a  usr/lib64/libstb.a && :
[riscv64] --
[riscv64] go.go:(.text+0x29a590): relocation truncated to fit: R_RISCV_JAL against symbol `crosscall2' defined in .text section in /usr/src/RPM/BUILD/nchat-5.14.44/riscv64-alt-linux/lib/wmchat/go/libcgowm.so(go.o)
[riscv64] collect2: error: ld returned 1 exit status
[riscv64] [646/650] /usr/bin/c++ -D_FILE_OFFSET_BITS=64 -D_GNU_SOURCE -I/usr/src/RPM/BUILD/nchat-5.14.44/lib/tgchat/ext/td -I/usr/src/RPM/BUILD/nchat-5.14.44/lib/tgchat/ext/td/td/generate/auto -I/usr/src/RPM/BUILD/nchat-5.14.44/lib/tgchat/ext/td/tdnet -I/usr/src/RPM/BUILD/nchat-5.14.44/lib/tgchat/ext/td/tdutils -I/usr/src/RPM/BUILD/nchat-5.14.44/riscv64-alt-linux/lib/tgchat/ext/td/tdutils -I/usr/src/RPM/BUILD/nchat-5.14.44/lib/tgchat/ext/td/tdactor -I/usr/src/RPM/BUILD/nchat-5.14.44/lib/tgchat/ext/td/tddb -I/usr/src/RPM/BUILD/nchat-5.14.44/lib/tgchat/ext/td/tde2e -pipe -frecord-gcc-switches -Wall -g -O2 -flto=auto -std=c++17 -fno-omit-frame-pointer -fno-exceptions -fno-rtti -ffunction-sections -fdata-sections -Wall -Wextra -flto-odr-type-merging -Walloc-zero -Wcast-qual -Wconversion -Wdeprecated -Wduplicated-branches -Wduplicated-cond -Wimplicit-fallthrough=2 -Wlogical-op -Wno-psabi -Wno-sign-conversion -Wno-tautological-compare -Wno-unused-parameter -Wnon-virtual-dtor -Wodr -Wpointe
 r-arith -Wsign-compare -Wvla -Wno-maybe-uninitialized -Wno-redundant-move -Wno-stringop-overflow -O2 -DNDEBUG -std=gnu++17 -fPIC -MD -MT lib/tgchat/ext/td/CMakeFiles/tdcore.dir/td/telegram/MessagesManager.cpp.o -MF lib/tgchat/ext/td/CMakeFiles/tdcore.dir/td/telegram/MessagesManager.cpp.o.d -o lib/tgchat/ext/td/CMakeFiles/tdcore.dir/td/telegram/MessagesManager.cpp.o -c /usr/src/RPM/BUILD/nchat-5.14.44/lib/tgchat/ext/td/td/telegram/MessagesManager.cpp
2026-Apr-22 06:56:33 :: [riscv64] nchat-5.14.44-alt1.src.rpm: remote: build failed
2026-Apr-22 06:56:33 :: [riscv64] #1000 nchat-5.14.44-alt1.src.rpm: build FAILED
2026-Apr-22 06:56:33 :: [riscv64] requesting cancellation of task processing
2026-Apr-22 06:56:33 :: [riscv64] build FAILED
2026-Apr-22 06:56:33 :: task #119898 for sisyphus_riscv64 FAILED


More information about the Riscv-reports mailing list