[riscv-reports] [#81762] sisyphus_riscv64 FAILED srpm=lact-0.7.3-alt2.src.rpm

Girar sisyphus_riscv64 awaiter recycler noreply at basealt.ru
Thu May 1 07:51:14 MSK 2025


http://web.build.srt.basealt.ru/tasks/81762/logs/events.1.1.log

2025-May-01 04:49:37 :: shared task #81762 for sisyphus_riscv64 started by recycler:
2025-May-01 04:49:37 :: message: sync_with_sisyphus
#100 build lact-0.7.3-alt2.src.rpm
2025-May-01 04:49:43 :: [riscv64] #100 lact-0.7.3-alt2.src.rpm: build start
2025-May-01 04:51:13 :: [riscv64] #100 lact-0.7.3-alt2.src.rpm: build SKIPPED
2025-May-01 04:51:13 :: #100: lact-0.7.3-alt2.src.rpm: no source package
2025-May-01 04:51:13 :: build check FAILED for: #100 
2025-May-01 04:51:13 :: task #81762 for sisyphus_riscv64 FAILED


More information about the Riscv-reports mailing list