[riscv-reports] [#76829] sisyphus_riscv64 FAILED srpm=vulkan-amdgpu-2025.Q1.3-alt1.src.rpm
Girar sisyphus_riscv64 awaiter recycler
noreply at basealt.ru
Thu Mar 20 09:46:06 MSK 2025
http://web.build.srt.basealt.ru/tasks/76829/logs/events.1.1.log
subtask name riscv64
#100 vulkan-amdgpu failed
2025-Mar-20 06:45:58 :: shared task #76829 for sisyphus_riscv64 started by recycler:
2025-Mar-20 06:45:58 :: message: sync_with_sisyphus
#100 build vulkan-amdgpu-2025.Q1.3-alt1.src.rpm
2025-Mar-20 06:46:00 :: [riscv64] #100 vulkan-amdgpu-2025.Q1.3-alt1.src.rpm: build start
[riscv64] E: Failed to fetch file:/home/builder0/gb-repo/riscv64/base/pkglist.classic File not found
[riscv64] E: Failed to fetch file:/home/builder0/gb-repo/noarch/base/pkglist.classic File not found
[riscv64] E: Some index files failed to download. They have been ignored, or old ones used instead.
2025-Mar-20 06:46:05 :: [riscv64] vulkan-amdgpu-2025.Q1.3-alt1.src.rpm: remote: initroot failed
2025-Mar-20 06:46:06 :: [riscv64] #100 vulkan-amdgpu-2025.Q1.3-alt1.src.rpm: build FAILED
2025-Mar-20 06:46:06 :: [riscv64] requesting cancellation of task processing
2025-Mar-20 06:46:06 :: [riscv64] build FAILED
2025-Mar-20 06:46:06 :: task #76829 for sisyphus_riscv64 FAILED
More information about the Riscv-reports
mailing list