[riscv-reports] [#71283] sisyphus_riscv64 FAILED srpm=rustdesk-1.3.7-alt2.src.rpm
Girar sisyphus_riscv64 awaiter recycler
noreply at basealt.ru
Tue Jan 28 06:04:51 MSK 2025
http://web.build.srt.basealt.ru/tasks/71283/logs/events.1.1.log
2025-Jan-28 03:03:04 :: shared task #71283 for sisyphus_riscv64 started by recycler:
2025-Jan-28 03:03:04 :: message: sync_with_sisyphus
#100 build rustdesk-1.3.7-alt2.src.rpm
2025-Jan-28 03:03:25 :: [riscv64] #100 rustdesk-1.3.7-alt2.src.rpm: build start
2025-Jan-28 03:04:50 :: [riscv64] #100 rustdesk-1.3.7-alt2.src.rpm: build SKIPPED
2025-Jan-28 03:04:51 :: #100: rustdesk-1.3.7-alt2.src.rpm: no source package
2025-Jan-28 03:04:51 :: build check FAILED for: #100
2025-Jan-28 03:04:51 :: task #71283 for sisyphus_riscv64 FAILED
More information about the Riscv-reports
mailing list