[riscv-reports] [#71048] sisyphus_riscv64 FAILED srpm=perl-Sys-CPU-0.61-alt6_20.src.rpm

Girar sisyphus_riscv64 awaiter iv noreply at basealt.ru
Sat Jan 25 08:38:20 MSK 2025


http://web.build.srt.basealt.ru/tasks/71048/logs/events.1.1.log

subtask  name          riscv64
   #100  perl-Sys-CPU   failed

2025-Jan-25 05:36:28 :: task #71048 for sisyphus_riscv64 started by iv:
#100 build perl-Sys-CPU-0.61-alt6_20.src.rpm
2025-Jan-25 05:36:39 :: [riscv64] #100 perl-Sys-CPU-0.61-alt6_20.src.rpm: build start
[riscv64] t/Sys-CPU.t (Wstat: 0 Tests: 4 Failed: 2)
[riscv64]   Failed tests:  3-4
[riscv64] Files=1, Tests=4,  0 wallclock secs ( 0.07 usr  0.01 sys +  0.01 cusr  0.03 csys =  0.12 CPU)
[riscv64] Result: FAIL
[riscv64] Failed 1/1 test programs. 2/4 subtests failed.
[riscv64] make: *** [Makefile:960: test_dynamic] Error 255
2025-Jan-25 05:38:19 :: [riscv64] perl-Sys-CPU-0.61-alt6_20.src.rpm: remote: build failed
2025-Jan-25 05:38:19 :: [riscv64] #100 perl-Sys-CPU-0.61-alt6_20.src.rpm: build FAILED
2025-Jan-25 05:38:19 :: [riscv64] requesting cancellation of task processing
2025-Jan-25 05:38:20 :: [riscv64] build FAILED
2025-Jan-25 05:38:20 :: task #71048 for sisyphus_riscv64 FAILED


More information about the Riscv-reports mailing list