[riscv-reports] [#71575] sisyphus_riscv64 FAILED srpm=python3-module-kivy-2.3.1-alt1.src.rpm

Girar sisyphus_riscv64 awaiter recycler noreply at basealt.ru
Sat Feb 1 21:27:21 MSK 2025


http://web.build.srt.basealt.ru/tasks/71575/logs/events.1.1.log

subtask  name                 riscv64
   #100  python3-module-kivy   failed

2025-Feb-01 05:02:57 :: shared task #71575 for sisyphus_riscv64 started by recycler:
2025-Feb-01 05:02:57 :: message: sync_with_sisyphus
#100 build python3-module-kivy-2.3.1-alt1.src.rpm
2025-Feb-01 05:03:07 :: [riscv64] #100 python3-module-kivy-2.3.1-alt1.src.rpm: build start
[riscv64] + cd /usr/src/RPM/BUILD
[riscv64] + cd python3-module-kivy-2.3.1
[riscv64] + export PYTHONPATH=/usr/src/tmp/python3-module-kivy-buildroot/usr/lib64/python3/site-packages
[riscv64] + PYTHONPATH=/usr/src/tmp/python3-module-kivy-buildroot/usr/lib64/python3/site-packages
[riscv64] + mv kivy kivy.notinpath
[riscv64] + py.test-3 -k 'not benchmark and not test_urlrequest_urllib and not test_remote_zipsequence and not test_audio and not test_local_zipsequence'
[riscv64] /usr/lib/python3/site-packages/pytest_asyncio/plugin.py:207: PytestDeprecationWarning: The configuration option "asyncio_default_fixture_loop_scope" is unset.
[riscv64] The event loop scope for asynchronous fixtures will default to the fixture caching scope. Future versions of pytest-asyncio will default the loop scope for asynchronous fixtures to function scope. Set the default fixture loop scope explicitly in order to avoid unexpected behavior in the future. Valid fixture loop scopes are: "function", "class", "module", "package", "session"
[riscv64]   warnings.warn(PytestDeprecationWarning(_DEFAULT_FIXTURE_LOOP_SCOPE_UNSET))
[riscv64] /usr/src/tmp/rpm-tmp.64111: line 140: 670009 Killed                  py.test-3 -k "not benchmark and not test_urlrequest_urllib and not test_remote_zipsequence and not test_audio and not test_local_zipsequence"
2025-Feb-01 18:27:21 :: [riscv64] python3-module-kivy-2.3.1-alt1.src.rpm: remote: build failed
2025-Feb-01 18:27:21 :: [riscv64] #100 python3-module-kivy-2.3.1-alt1.src.rpm: build FAILED
2025-Feb-01 18:27:21 :: [riscv64] requesting cancellation of task processing
2025-Feb-01 18:27:21 :: [riscv64] build FAILED
2025-Feb-01 18:27:21 :: task #71575 for sisyphus_riscv64 FAILED


More information about the Riscv-reports mailing list