[riscv-reports] [#92935] [test-only] sisyphus_riscv64 FAILED chromium.git=139.0.7258.138-alt0.port.0.rv
Girar sisyphus_riscv64 awaiter iv
noreply at basealt.ru
Fri Aug 22 14:06:57 MSK 2025
http://web.build.srt.basealt.ru/tasks/92935/logs/events.1.1.log
subtask name riscv64
#100 chromium 15:34:53
2025-Aug-21 19:28:19 :: test-only task #92935 for sisyphus_riscv64 started by iv:
2025-Aug-21 19:28:19 :: message: sync
#100 build 139.0.7258.138-alt0.port.0.rv from /people/iv/packages/chromium.git fetched at 2025-Aug-21 19:28:15
2025-Aug-21 19:28:25 :: [riscv64] #100 chromium.git 139.0.7258.138-alt0.port.0.rv: build start
2025-Aug-22 11:03:18 :: [riscv64] #100 chromium.git 139.0.7258.138-alt0.port.0.rv: build OK
2025-Aug-22 11:03:18 :: #100: chromium.git 139.0.7258.138-alt0.port.0.rv: build check OK
2025-Aug-22 11:03:18 :: build check OK
2025-Aug-22 11:03:19 :: noarch check OK
2025-Aug-22 11:03:19 :: plan: src +1 -1 =19455, riscv64 +1 -1 =34387
#100 chromium 139.0.7258.127-alt0.port.0.rv -> 139.0.7258.138-alt0.port.0.rv
Thu Aug 21 2025 Ivan A. Melnikov <iv at altlinux.org> 139.0.7258.138-alt0.port.0.rv
- build on riscv64
Thu Aug 21 2025 Ivan A. Melnikov <iv at altlinux.org> 139.0.7258.138-alt0.port
- loongach64 support (thx asheplyakov@)
- use mold for linking on loongarch64
Wed Aug 20 2025 Andrew A. Vasilyev <andy at altlinux.org> 139.0.7258.138-alt1
- New version (139.0.7258.138).
- Fixes:
+ CVE-2025-9132: Out of bounds write in V8
2025-Aug-22 11:03:44 :: patched apt indices
2025-Aug-22 11:03:46 :: created next repo
2025-Aug-22 11:03:55 :: duplicate provides check OK
2025-Aug-22 11:04:17 :: dependencies check OK
2025-Aug-22 11:04:45 :: [riscv64] ELF symbols check OK
2025-Aug-22 11:05:04 :: [riscv64.0] #100 chromium: install check start
riscv64: chromium=139.0.7258.138-alt0.port.0.rv post-install unowned files:
/usr/share/gnome-control-center
2025-Aug-22 11:06:51 :: [riscv64.0] #100 chromium: install check OK
error: #100: chromium.git tag `139.0.7258.138-alt0.port.0.rv' is not inherited from /gears/c/chromium.git branch `sisyphus_riscv64'
2025-Aug-22 11:06:57 :: gears inheritance check FAILED for: #100
2025-Aug-22 11:06:57 :: task #92935 for sisyphus_riscv64 FAILED
More information about the Riscv-reports
mailing list