[riscv-reports] [#33166] FAILED srpm=zabbix-6.0.17-alt1.src.rpm ...

Girar awaiter robot awaiter at gyle-riscv.office.basealt.ru
Wed May 24 16:55:47 MSK 2023


http://git.altlinux.org/tasks/33166/logs/events.1.1.log

2023-May-24 12:35:42 :: shared task #33166 for sisyphus_riscv64 started by recycler:
#100 build zabbix-6.0.17-alt1.src.rpm
#200 build zabbix-preinstall-2.2.2-alt2.3.src.rpm
2023-May-24 12:36:13 :: created build repo
2023-May-24 12:36:29 :: [riscv64] #100 zabbix-6.0.17-alt1.src.rpm: build start
2023-May-24 12:38:33 :: task abort requested by iv.
plugins/system/uname/uname_linux.go:40:3: undefined: arrayToString
plugins/system/uname/uname_linux.go:67:14: undefined: arrayToString
plugins/system/uname/uname_linux.go:69:14: undefined: arrayToString
plugins/system/uname/uname_linux.go:102:9: undefined: arrayToString
make[2]: *** [Makefile:619: zabbix.com/cmd/zabbix_agent2] Error 1
make[2]: Leaving directory '/usr/src/RPM/BUILD/zabbix-6.0.17/src/go'
make[1]: *** [Makefile:510: all-recursive] Error 1
make[1]: Leaving directory '/usr/src/RPM/BUILD/zabbix-6.0.17/src'
make: *** [Makefile:546: all-recursive] Error 1
make: Leaving directory '/usr/src/RPM/BUILD/zabbix-6.0.17'
2023-May-24 13:55:46 :: [riscv64] zabbix-6.0.17-alt1.src.rpm: remote: build failed
2023-May-24 13:55:46 :: [riscv64] #100 zabbix-6.0.17-alt1.src.rpm: build FAILED
2023-May-24 13:55:46 :: [riscv64] build FAILED
2023-May-24 13:55:46 :: task #33166 for sisyphus_riscv64 FAILED


More information about the Riscv-reports mailing list