[riscv-reports] [#25173] FAILED srpm=python3-module-tempest-32.0.0-alt1.src.rpm ...

Girar awaiter robot awaiter at gyle-riscv.office.basealt.ru
Fri Oct 21 19:52:56 MSK 2022


http://git.altlinux.org/tasks/25173/logs/events.1.1.log

2022-Oct-21 15:54:36 :: shared task #25173 for sisyphus_riscv64 started by recycler:
#100 build python3-module-tempest-32.0.0-alt1.src.rpm
#200 build python3-module-blazarclient-3.5.0-alt1.src.rpm
#300 build python3-module-designateclient-5.0.0-alt1.src.rpm
#400 build python3-module-dracclient-8.0.0-alt1.src.rpm
#500 build python3-module-glanceclient-4.1.0-alt1.src.rpm
#600 build python3-module-heatclient-3.1.0-alt1.src.rpm
#700 build python3-module-keystoneclient-5.0.1-alt1.src.rpm
#1000 build python3-module-magnumclient-4.0.0-alt1.src.rpm
#1100 build python3-module-mistralclient-4.5.0-alt1.src.rpm
#1200 build python3-module-monascaclient-2.6.0-alt1.src.rpm
#1300 build python3-module-neutronclient-8.1.0-alt1.src.rpm
#1400 build python3-module-novaclient-18.1.0-alt1.src.rpm
#1500 build python3-module-openstackclient-6.0.0-alt1.src.rpm
#1600 build python3-module-senlinclient-2.5.0-alt1.src.rpm
#1700 build python3-module-troveclient-8.0.0-alt1.src.rpm
#2000 build python3-module-vitrageclient-4.6.0-alt1.src.rpm
#2100 build python3-module-zaqarclient-2.4.0-alt1.src.rpm
#2200 build python3-module-zunclient-4.5.0-alt1.src.rpm
#2300 build python3-module-swiftclient-4.1.0-alt1.src.rpm
#2400 build python3-module-aodhclient-3.0.0-alt1.src.rpm
#2500 build python3-module-manilaclient-4.1.0-alt1.src.rpm
2022-Oct-21 15:54:57 :: created build repo
2022-Oct-21 15:55:05 :: [riscv64] #100 python3-module-tempest-32.0.0-alt1.src.rpm: build start
2022-Oct-21 16:10:25 :: [riscv64] #100 python3-module-tempest-32.0.0-alt1.src.rpm: build OK
2022-Oct-21 16:10:25 :: [riscv64] #200 python3-module-blazarclient-3.5.0-alt1.src.rpm: build start
2022-Oct-21 16:16:20 :: [riscv64] #200 python3-module-blazarclient-3.5.0-alt1.src.rpm: build OK
2022-Oct-21 16:16:20 :: [riscv64] #300 python3-module-designateclient-5.0.0-alt1.src.rpm: build start
2022-Oct-21 16:25:03 :: [riscv64] #300 python3-module-designateclient-5.0.0-alt1.src.rpm: build OK
2022-Oct-21 16:25:03 :: [riscv64] #400 python3-module-dracclient-8.0.0-alt1.src.rpm: build start
2022-Oct-21 16:41:47 :: [riscv64] #400 python3-module-dracclient-8.0.0-alt1.src.rpm: build OK
2022-Oct-21 16:41:47 :: [riscv64] #500 python3-module-glanceclient-4.1.0-alt1.src.rpm: build start
2022-Oct-21 16:51:14 :: [riscv64] #500 python3-module-glanceclient-4.1.0-alt1.src.rpm: build OK
2022-Oct-21 16:51:14 :: [riscv64] #600 python3-module-heatclient-3.1.0-alt1.src.rpm: build start
egrep: warning: egrep is obsolescent; using grep -E
warning: user grenka does not exist - using root
warning: group grenka does not exist - using root
warning: user grenka does not exist - using root
warning: group grenka does not exist - using root
warning: user grenka does not exist - using root
warning: group grenka does not exist - using root
<13>Oct 21 16:52:44 rpmi: mpdecimal-2.5.1-alt1 sisyphus_riscv64+16252.400.1.1 1643773165 installed
<13>Oct 21 16:52:44 rpmi: libgdbm-1.8.3-alt10 sisyphus_riscv64+8290.100.1.1 1632325631 installed
<13>Oct 21 16:52:44 rpmi: libexpat-2.4.9-alt1 sisyphus_riscv64+24268.100.1.1 1664096017 installed
<13>Oct 21 16:52:44 rpmi: libp11-kit-0.24.1-alt1 sisyphus_riscv64+15481.100.1.1 1642606328 installed
<13>Oct 21 16:52:44 rpmi: libtasn1-4.19.0-alt1 sisyphus_riscv64+23308.100.1.1 1661373120 installed
<13>Oct 21 16:52:44 rpmi: rpm-macros-alternatives-0.5.2-alt1 sisyphus_riscv64+20303.100.2.1 1654012705 installed
<13>Oct 21 16:52:44 rpmi: alternatives-0.5.2-alt1 sisyphus_riscv64+20303.100.2.1 1654012705 installed
<13>Oct 21 16:52:44 rpmi: ca-certificates-2022.09.15-alt1 sisyphus_riscv64+24014.200.1.1 1663453031 installed
<13>Oct 21 16:52:44 rpmi: ca-trust-0.1.4-alt1 sisyphus_riscv64+25122.100.1.1 1666219823 installed
<13>Oct 21 16:52:44 rpmi: p11-kit-trust-0.24.1-alt1 sisyphus_riscv64+15481.100.1.1 1642606328 installed
<13>Oct 21 16:52:44 rpmi: libcrypto1.1-1.1.1q-alt1 sisyphus_riscv64+21832.100.1.1 1657046249 installed
<13>Oct 21 16:52:44 rpmi: libssl1.1-1.1.1q-alt1 sisyphus_riscv64+21832.100.1.1 1657046249 installed
<13>Oct 21 16:52:45 rpmi: python3-3.10.7-alt1 sisyphus_riscv64+23802.100.1.1 1663124553 installed
<13>Oct 21 16:52:48 rpmi: python3-base-3.10.7-alt1 sisyphus_riscv64+23802.100.1.1 1663124553 installed
<13>Oct 21 16:52:48 rpmi: tests-for-installed-python3-pkgs-0.1.19-alt1 sisyphus_riscv64+22408.200.1.1 1658295641 installed
<13>Oct 21 16:52:48 rpmi: rpm-build-python3-0.1.19-alt1 sisyphus_riscv64+22408.200.1.1 1658295641 installed
WARNING: %python3_build is deprecated and will be removed in future, please use %pyproject_build instead
WARNING: %python3_install is deprecated and will be removed in future, please use %pyproject_install instead
Reading Package Lists...
Building Dependency Tree...
MI2a: mark python3-module-babel
MI2a:  target python3(pytz)
MI2a:   mark python3-module-pytz
MI2a: mark python3-module-pbr
MI2a:  target python3(pkg_resources)
MI2a:   mark python3-module-pkg_resources
MI2a:  target python3(setuptools)
MI2a:   mark python3-module-setuptools
MI2a:    target python3-dev
MI2a:     mark python3-dev
MI2a:      target libncurses-devel
MI2a:       mark libncurses-devel
MI2a:        target libtinfo-devel
MI2a:         mark libtinfo-devel
MI2a:        target libncurses
MI2a:         mark libncurses
MI2a:      target libpython3
MI2a:       mark libpython3
MI2a: mark python3-module-cliff
MI2a:  target python3(autopage)
MI2a:   mark python3-module-autopage
MI2a:    target python3(fixtures)
MI2a:     mark python3-module-fixtures
MI2a:      target python3(mock)
MI2a:       mark python3-module-mock
MI2a:      target python3(testtools)
MI2a:       mark python3-module-testtools
MI2a:        target python3(testscenarios)
MI2a:         mark python3-module-testscenarios
MI2a:        target python3(twisted.internet)
MI2a:         mark python3-module-twisted-core
MI2a:          target python3-module-OpenSSL
MI2a:           mark python3-module-openssl
MI2a:            target python3(cffi)
MI2a:             mark python3-module-cffi
MI2a:              target python3(pycparser)
MI2a:               mark python3-module-pycparser
MI2a:            target python3(cryptography)
MI2a:             mark python3-module-cryptography
MI2a:          target python3(appdirs)
MI2a:           mark python3-module-appdirs
MI2a:          target python3(attr)
MI2a:           mark python3-module-attrs
MI2a:          target python3(automat)
MI2a:           mark python3-module-automat
MI2a:            target python3(six)
MI2a:             mark python3-module-six
MI2a:          target python3(gobject)
MI2a:           mark python3-module-pygobject
MI2a:          target python3(hyperlink)
MI2a:           mark python3-module-hyperlink
MI2a:            target python3(idna)
MI2a:             mark python3-module-idna
MI2a:          target python3(serial)
MI2a:           mark python3-module-serial
MI2a:            target python3(hid)
MI2a:             mark python3-module-cython-hidapi
MI2a:              target libhidapi-hidraw.so.0()(64bit)
MI2a:               mark libhidapi
MI2a:                target libusb-1.0.so.0()(64bit)
MI2a:                 mark libusb
MI2a:          target python3(zope.interface.adapter)
MI2a:           mark python3-module-zope.interface
MI2a:          target python3-module-twisted-logger
MI2a:           mark python3-module-twisted-logger
MI2a:            target python3(constantly)
MI2a:             mark python3-module-constantly
MI2a:          target python3-module-twisted-words
MI2a:           mark python3-module-twisted-words
MI2a:            target python3(incremental)
MI2a:             mark python3-module-incremental
MI2a:              target python3(click)
MI2a:               mark python3-module-click
MI2a:  target python3(cmd2)
MI2a:   mark python3-module-cmd2
MI2a:    target python3(pyperclip)
MI2a:     mark python3-module-pyperclip
MI2a:    target python3(wcwidth)
MI2a:     mark python3-module-wcwidth
MI2a:  target python3(docutils)
MI2a:   mark python3-module-docutils
MI2a:    target python3(lxml)
MI2a:     mark python3-module-lxml
MI2a:      target python3-module-cssselect
MI2a:       mark python3-module-cssselect
MI2a:      target libexslt.so.0()(64bit)
MI2a:       mark libxslt
MI2a:      target python3(html5lib)
MI2a:       mark python3-module-html5lib
MI2a:        target python3(genshi.core)
MI2a:         mark python3-module-genshi
MI2a:        target python3(webencodings)
MI2a:         mark python3-module-webencodings
MI2a:  target python3(importlib_metadata)
MI2a:   mark python3-module-importlib-metadata
MI2a:    target python3(zipp)
MI2a:     mark python3-module-zipp
MI2a:  target python3(prettytable)
MI2a:   mark python3-module-prettytable
MI2a:  target python3(stevedore)
MI2a:   mark python3-module-stevedore
MI2a:    target python3(sphinx.util)
MI2a:     mark python3-module-sphinx
MI2a:      target python3(sphinxcontrib.applehelp)
MI2a:       mark python3-module-sphinxcontrib-applehelp
MI2a:      target python3(sphinxcontrib.devhelp)
MI2a:       mark python3-module-sphinxcontrib-devhelp
MI2a:      target python3(sphinxcontrib.htmlhelp)
MI2a:       mark python3-module-sphinxcontrib-htmlhelp
MI2a:      target python3(sphinxcontrib.jsmath)
MI2a:       mark python3-module-sphinxcontrib-jsmath
MI2a:      target python3(sphinxcontrib.qthelp)
MI2a:       mark python3-module-sphinxcontrib-qthelp
MI2a:      target python3(alabaster)
MI2a:       mark python3-module-alabaster
MI2a:        target python3(pygments.style)
MI2a:         mark python3-module-Pygments
MI2a:      target python3(requests)
MI2a:       mark python3-module-requests
MI2a:        target python3(charset_normalizer)
MI2a:         mark python3-module-charset-normalizer
MI2a:        target python3(urllib3)
MI2a:         mark python3-module-urllib3
MI2a:      target /usr/share/python-sphinx/objects.inv
MI2a:       mark python-sphinx-objects.inv
MI2a:      target python3(imagesize)
MI2a:       mark python3-module-imagesize
MI2a:      target python3(jinja2)
MI2a:       mark python3-module-jinja2
MI2a:        target python3(markupsafe)
MI2a:         mark python3-module-markupsafe
MI2a:      target python3(packaging)
MI2a:       mark python3-module-packaging
MI2a:        target python3(pyparsing)
MI2a:         mark python3-module-pyparsing
MI2a:          target python3(railroad)
MI2a:           mark python3-module-railroad-diagrams
MI2a:      target python3(snowballstemmer)
MI2a:       mark python3-module-snowballstemmer
MI2a:      target python3(sphinxcontrib.serializinghtml)
MI2a:       mark python3-module-sphinxcontrib-serializinghtml
MI2a: mark python3-module-osc-lib
MI2a:  target python3(keystoneauth1)
MI2a:   mark python3-module-keystoneauth1
MI2a:    target python3(betamax)
MI2a:     mark python3-module-betamax
MI2a:    target python3(os_service_types)
MI2a:     mark python3-module-os-service-types
MI2a:    target python3(yaml)
MI2a:     mark python3-module-yaml
MI2a:      target libyaml-0.so.2()(64bit)
MI2a:       mark libyaml2
MI2a:  target python3(openstack)
MI2a:   mark python3-module-openstacksdk
MI2a:    target python3(decorator)
MI2a:     mark python3-module-decorator
MI2a:    target python3(dogpile.cache)
MI2a:     mark python3-module-dogpile.cache
MI2a:      target python3(mako.cache)
MI2a:       mark python3-module-mako
MI2a:        target python3-module-beaker
MI2a:         mark python3-module-beaker
MI2a:          target python3(nss.nss)
MI2a:           mark python3-module-nss
MI2a:            target libnspr4.so()(64bit)
MI2a:             mark libnspr
MI2a:            target libnss3.so()(64bit)
MI2a:             mark libnss
MI2a:              target libsqlite3.so.0()(64bit)
MI2a:               mark libsqlite3
MI2a:        target python3(lingua.extractors)
MI2a:         mark python3-module-lingua
MI2a:          target python3(chameleon.namespaces)
MI2a:           mark python3-module-chameleon.core
MI2a:          target python3(polib)
MI2a:           mark python3-module-polib
MI2a:        target python3(pytest)
MI2a:         mark python3-module-pytest
MI2a:          target python3(py)
MI2a:           mark python3-module-py
MI2a:            target python3(apipkg)
MI2a:             mark python3-module-apipkg
MI2a:            target python3(iniconfig)
MI2a:             mark python3-module-iniconfig
MI2a:          target python3(tomli)
MI2a:           mark python3-module-tomli
MI2a:          target python3(pluggy)
MI2a:           mark python3-module-pluggy
MI2a:    target python3(hacking)
MI2a:     mark python3-module-hacking
MI2a:      target python3(flake8)
MI2a:       mark python3-module-flake8
MI2a:        target python3(mccabe)
MI2a:         mark python3-module-mccabe
MI2a:        target python3(pycodestyle)
MI2a:         mark python3-module-pycodestyle
MI2a:        target python3(pyflakes)
MI2a:         mark python3-module-pyflakes
MI2a:    target python3(jmespath)
MI2a:     mark python3-module-jmespath
MI2a:    target python3(jsonpatch)
MI2a:     mark python3-module-jsonpatch
MI2a:      target python3(jsonpointer)
MI2a:       mark python3-module-jsonpointer
MI2a:    target python3(munch)
MI2a:     mark python3-module-munch
MI2a:    target python3(netifaces)
MI2a:     mark python3-module-netifaces
MI2a:    target python3(requestsexceptions)
MI2a:     mark python3-module-requestsexceptions
MI2a:  target python3(oslo_i18n)
MI2a:   mark python3-module-oslo.i18n
MI2a:  target python3(oslo_utils)
MI2a:   mark python3-module-oslo.utils
MI2a:    target python3(debtcollector)
MI2a:     mark python3-module-debtcollector
MI2a:      target python3(wrapt)
MI2a:       mark python3-module-wrapt
MI2a:    target python3(netaddr)
MI2a:     mark python3-module-netaddr
MI2a:  target python3(simplejson)
MI2a:   mark python3-module-simplejson
MI2a: mark python3-module-oslo.serialization
MI2a:  target python3(msgpack)
MI2a:   mark python3-module-msgpack
rpm-build-python3 is already the newest version.
Selected version python3-module-pbr#5.11.0-alt1:sisyphus_riscv64+25152.100.1.1 at 1666271900 for python3-module-pbr>=2.0.0
Selected version python3-module-cliff#4.0.0-alt2.1:sisyphus_riscv64+25161.100.1.1 at 1666347352 for python3-module-cliff>=2.8.0
Selected version python3-module-iso8601#0.1.16-alt1:sisyphus_riscv64+16104.100.1.1 at 1643349551 for python3-module-iso8601>=0.1.11
Selected version python3-module-osc-lib#2.6.2-alt2:sisyphus_riscv64+25091.1000.2.1 at 1666250098 for python3-module-osc-lib>=1.14.0
Version python3-module-prettytable#2.1.0-alt1:sisyphus_riscv64+8653.100.1.1 at 1633649374 for python3-module-prettytable>=0.7.2 is already selected for install
Version python3-module-oslo.i18n#5.1.0-alt3:sisyphus_riscv64+25091.1400.2.1 at 1666251613 for python3-module-oslo.i18n>=3.15.3 is already selected for install
Selected version python3-module-oslo.serialization#5.0.0-alt2:sisyphus_riscv64+25091.2000.2.1 at 1666253375 for python3-module-oslo.serialization>=2.18.0
Version python3-module-oslo.utils#6.0.1-alt2:sisyphus_riscv64+25091.2400.2.1 at 1666254903 for python3-module-oslo.utils>=3.33.0 is already selected for install
Version python3-module-keystoneauth1#5.0.0-alt2.1:sisyphus_riscv64+25161.200.1.1 at 1666348016 for python3-module-keystoneauth1>=3.8.0 is already selected for install
W: pkgMakeStatusCache: The configured APT::Cache-Limit (134217728) is below the recommended default value (201326592). Remove it to use the default.
W: You may want to run apt-get update to correct these problems
E: Couldn't find package python3-module-swiftclient>=3.2.0
hsh-install: Failed to calculate package file list.
hsh-install: Failed to generate package file list.
2022-Oct-21 16:52:56 :: [riscv64] python3-module-heatclient-3.1.0-alt1.src.rpm: remote: cannot build src.rpm
2022-Oct-21 16:52:56 :: [riscv64] #600 python3-module-heatclient-3.1.0-alt1.src.rpm: build FAILED
2022-Oct-21 16:52:56 :: [riscv64] requesting cancellation of task processing
2022-Oct-21 16:52:56 :: [riscv64] build FAILED
2022-Oct-21 16:52:56 :: task #25173 for sisyphus_riscv64 FAILED


More information about the Riscv-reports mailing list