[riscv-reports] [#25159] FAILED srpm=python3-module-w3lib-2.0.1-alt1.src.rpm ...

Girar awaiter robot awaiter at gyle-riscv.office.basealt.ru
Fri Oct 21 13:05:08 MSK 2022


2022-Oct-21 09:57:35 :: shared task #25159 for sisyphus_riscv64 started by recycler:
#100 build python3-module-w3lib-2.0.1-alt1.src.rpm
#200 build python3-module-parsel-1.6.0-alt1.src.rpm
#300 build python3-module-dateparser-1.1.2-alt1.src.rpm
2022-Oct-21 09:57:46 :: created build repo
2022-Oct-21 09:57:54 :: [riscv64] #100 python3-module-w3lib-2.0.1-alt1.src.rpm: build start
2022-Oct-21 10:03:31 :: [riscv64] #100 python3-module-w3lib-2.0.1-alt1.src.rpm: build OK
2022-Oct-21 10:03:31 :: [riscv64] #200 python3-module-parsel-1.6.0-alt1.src.rpm: build start
egrep: warning: egrep is obsolescent; using grep -E
warning: user aris does not exist - using root
warning: group aris does not exist - using root
warning: user aris does not exist - using root
warning: group aris does not exist - using root
<13>Oct 21 10:04:56 rpmi: mpdecimal-2.5.1-alt1 sisyphus_riscv64+16252.400.1.1 1643773165 installed
<13>Oct 21 10:04:56 rpmi: libgdbm-1.8.3-alt10 sisyphus_riscv64+8290.100.1.1 1632325631 installed
<13>Oct 21 10:04:56 rpmi: libexpat-2.4.9-alt1 sisyphus_riscv64+24268.100.1.1 1664096017 installed
<13>Oct 21 10:04:56 rpmi: libp11-kit-0.24.1-alt1 sisyphus_riscv64+15481.100.1.1 1642606328 installed
<13>Oct 21 10:04:56 rpmi: libtasn1-4.19.0-alt1 sisyphus_riscv64+23308.100.1.1 1661373120 installed
<13>Oct 21 10:04:56 rpmi: rpm-macros-alternatives-0.5.2-alt1 sisyphus_riscv64+20303.100.2.1 1654012705 installed
<13>Oct 21 10:04:56 rpmi: alternatives-0.5.2-alt1 sisyphus_riscv64+20303.100.2.1 1654012705 installed
<13>Oct 21 10:04:57 rpmi: ca-certificates-2022.09.15-alt1 sisyphus_riscv64+24014.200.1.1 1663453031 installed
<13>Oct 21 10:04:57 rpmi: ca-trust-0.1.4-alt1 sisyphus_riscv64+25122.100.1.1 1666219823 installed
<13>Oct 21 10:04:57 rpmi: p11-kit-trust-0.24.1-alt1 sisyphus_riscv64+15481.100.1.1 1642606328 installed
<13>Oct 21 10:04:57 rpmi: libcrypto1.1-1.1.1q-alt1 sisyphus_riscv64+21832.100.1.1 1657046249 installed
<13>Oct 21 10:04:57 rpmi: libssl1.1-1.1.1q-alt1 sisyphus_riscv64+21832.100.1.1 1657046249 installed
<13>Oct 21 10:04:57 rpmi: python3-3.10.7-alt1 sisyphus_riscv64+23802.100.1.1 1663124553 installed
<13>Oct 21 10:05:00 rpmi: python3-base-3.10.7-alt1 sisyphus_riscv64+23802.100.1.1 1663124553 installed
<13>Oct 21 10:05:00 rpmi: tests-for-installed-python3-pkgs-0.1.19-alt1 sisyphus_riscv64+22408.200.1.1 1658295641 installed
<13>Oct 21 10:05:00 rpmi: rpm-build-python3-0.1.19-alt1 sisyphus_riscv64+22408.200.1.1 1658295641 installed
Reading Package Lists...
Building Dependency Tree...
MI2a: mark python3-module-wheel
MI2a:  target python3(pkg_resources)
MI2a:   mark python3-module-pkg_resources
MI2a: mark python3-module-setuptools
MI2a:  target python3-dev
MI2a:   mark python3-dev
MI2a:    target libncurses-devel
MI2a:     mark libncurses-devel
MI2a:      target libtinfo-devel
MI2a:       mark libtinfo-devel
MI2a:      target libncurses
MI2a:       mark libncurses
MI2a:    target libpython3
MI2a:     mark libpython3
MI2a: mark python3-module-pytest
MI2a:  target python3(py)
MI2a:   mark python3-module-py
MI2a:    target python3(apipkg)
MI2a:     mark python3-module-apipkg
MI2a:    target python3(iniconfig)
MI2a:     mark python3-module-iniconfig
MI2a:  target python3(tomli)
MI2a:   mark python3-module-tomli
MI2a:  target python3(packaging)
MI2a:   mark python3-module-packaging
MI2a:    target python3(pyparsing)
MI2a:     mark python3-module-pyparsing
MI2a:      target python3(jinja2)
MI2a:       mark python3-module-jinja2
MI2a:        target python3(markupsafe)
MI2a:         mark python3-module-markupsafe
MI2a:      target python3(railroad)
MI2a:       mark python3-module-railroad-diagrams
MI2a:  target python3(attr)
MI2a:   mark python3-module-attrs
MI2a:  target python3(pluggy)
MI2a:   mark python3-module-pluggy
MI2a: mark python3-module-pytest-cov
MI2a:  target python3(coverage)
MI2a:   mark python3-module-coverage
MI2a:    target python3(sqlite3)
MI2a:     mark python3-modules-sqlite3
MI2a:      target libsqlite3.so.0()(64bit)
MI2a:       mark libsqlite3
rpm-build-python3 is already the newest version.
W: pkgMakeStatusCache: The configured APT::Cache-Limit (134217728) is below the recommended default value (201326592). Remove it to use the default.
W: You may want to run apt-get update to correct these problems
E: Couldn't find package python3-module-sybil
hsh-install: Failed to calculate package file list.
hsh-install: Failed to generate package file list.
2022-Oct-21 10:05:07 :: [riscv64] python3-module-parsel-1.6.0-alt1.src.rpm: remote: cannot build src.rpm
2022-Oct-21 10:05:07 :: [riscv64] #200 python3-module-parsel-1.6.0-alt1.src.rpm: build FAILED
2022-Oct-21 10:05:08 :: [riscv64] requesting cancellation of task processing
2022-Oct-21 10:05:08 :: [riscv64] build FAILED
2022-Oct-21 10:05:08 :: task #25159 for sisyphus_riscv64 FAILED

More information about the Riscv-reports mailing list