[riscv-reports] [#24322] FAILED srpm=openconnect-9.01-alt1.src.rpm ...

Girar awaiter robot awaiter at gyle-riscv.office.basealt.ru
Sat Oct 1 02:59:04 MSK 2022


2022-Sep-30 23:56:02 :: shared task #24322 for sisyphus_riscv64 started by recycler:
#100 build openconnect-9.01-alt1.src.rpm
#200 build NetworkManager-openconnect-1.2.8-alt1.src.rpm
2022-Sep-30 23:56:17 :: created build repo
2022-Sep-30 23:56:23 :: [riscv64] #100 openconnect-9.01-alt1.src.rpm: build start
egrep: warning: egrep is obsolescent; using grep -E
Reading Package Lists...
Building Dependency Tree...
MI2a: mark rpm-build-python3
MI2a:  target /usr/lib/rpm/python3-site-packages-files.req.list
MI2a:   mark python3-base
MI2a:    target libcrypto.so.1.1()(64bit)
MI2a:     mark libcrypto1.1
MI2a:      target ca-certificates
MI2a:       mark ca-certificates
MI2a:        target ca-trust
MI2a:         mark ca-trust
MI2a:          target p11-kit-trust
MI2a:           mark p11-kit-trust
MI2a:            target /etc/alternatives/packages.d
MI2a:             mark alternatives
MI2a:              target rpm-macros-alternatives
MI2a:               mark rpm-macros-alternatives
MI2a:            target libtasn1.so.6()(64bit)
MI2a:             mark libtasn1
MI2a:            target libp11-kit
MI2a:             mark libp11-kit
MI2a:    target libexpat.so.1()(64bit)
MI2a:     mark libexpat
MI2a:    target libgdbm.so.3()(64bit)
MI2a:     mark libgdbm
MI2a:    target libmpdec.so.3()(64bit)
MI2a:     mark mpdecimal
MI2a:    target libssl.so.1.1()(64bit)
MI2a:     mark libssl1.1
MI2a:    target python3
MI2a:     mark python3
MI2a:  target tests-for-installed-python3-pkgs
MI2a:   mark tests-for-installed-python3-pkgs
MI2a: mark liblz4-devel
MI2a:  target liblz4
MI2a:   mark liblz4
MI2a: mark libgnutls-devel
MI2a:  target libgnutls30
MI2a:   mark libgnutls30
MI2a:    target libhogweed.so.6()(64bit)
MI2a:     mark libhogweed6
MI2a:      target libnettle8
MI2a:       mark libnettle8
MI2a:    target libidn2.so.0()(64bit)
MI2a:     mark libidn2
MI2a: mark libtrousers-devel
MI2a:  target libtrousers
MI2a:   mark libtrousers
MI2a: mark libtpm2-tss-devel
MI2a:  target libtpm2-tss0
MI2a:   mark libtpm2-tss0
MI2a:    target libcurl.so.4()(64bit)
MI2a:     mark libcurl
MI2a:      target libbrotlidec.so.1()(64bit)
MI2a:       mark libbrotlidec
MI2a:        target libbrotlicommon
MI2a:         mark libbrotlicommon
MI2a:      target libgssapi_krb5.so.2()(64bit)
MI2a:       mark libkrb5
MI2a:        target libcom_err.so.2()(64bit)
MI2a:         mark libcom_err
MI2a:        target libkeyutils.so.1()(64bit)
MI2a:         mark libkeyutils
MI2a:        target liblmdb.so.0()(64bit)
MI2a:         mark liblmdb
MI2a:        target libverto.so.1()(64bit)
MI2a:         mark libverto
MI2a:      target liblber.so.2()(64bit)
MI2a:       mark libldap2
MI2a:        target libsasl2.so.3()(64bit)
MI2a:         mark libsasl2-3
MI2a:        target openldap-common
MI2a:         mark openldap-common
MI2a:      target libnghttp2.so.14()(64bit)
MI2a:       mark libnghttp2
MI2a:      target libpsl.so.5()(64bit)
MI2a:       mark libpsl
MI2a:        target publicsuffix-list-dafsa
MI2a:         mark publicsuffix-list-dafsa
MI2a:    target libjson-c.so.5()(64bit)
MI2a:     mark libjson-c5
MI2a:    target libtpm2-tss-common
MI2a:     mark libtpm2-tss-common
MI2a:      target /lib/udev/rules.d
MI2a:       mark udev
MI2a:        target dmsetup
MI2a:         mark dmsetup
MI2a:          target lsblk
MI2a:           mark lsblk
MI2a:          target libdevmapper
MI2a:           mark libdevmapper
MI2a:        target kmod
MI2a:         mark kmod
MI2a:          target libkmod
MI2a:           mark libkmod
MI2a:        target losetup
MI2a:         mark losetup
MI2a:        target mount
MI2a:         mark mount
MI2a: mark libgcrypt-devel
MI2a:  target libgpg-error-devel
MI2a:   mark libgpg-error-devel
Selecting liblz4-devel for 'pkgconfig(liblz4)'
Selecting libxml2-devel for 'pkgconfig(libxml-2.0)'
Selecting zlib-devel for 'pkgconfig(zlib)'
Selected version libgnutls-devel#3.7.7-alt1:sisyphus_riscv64+22772.200.1.1 at 1659635124 for pkgconfig(gnutls)>3.2.10
Selecting libp11-kit-devel for 'pkgconfig(p11-kit-1)'
Selecting libtasn1-devel for 'pkgconfig(libtasn1)'
Selecting libtpm2-tss-devel for 'pkgconfig(tss2-esys)'
Selecting libtpm2-tss-devel for 'pkgconfig(tss2-mu)'
Selecting libtpm2-tss-devel for 'pkgconfig(tss2-tctildr)'
W: pkgMakeStatusCache: The configured APT::Cache-Limit (134217728) is below the recommended default value (201326592). Remove it to use the default.
W: You may want to run apt-get update to correct these problems
E: Couldn't find package swtpm
hsh-install: Failed to calculate package file list.
hsh-install: Failed to generate package file list.
2022-Sep-30 23:59:04 :: [riscv64] openconnect-9.01-alt1.src.rpm: remote: cannot build src.rpm
2022-Sep-30 23:59:04 :: [riscv64] #100 openconnect-9.01-alt1.src.rpm: build FAILED
2022-Sep-30 23:59:04 :: [riscv64] requesting cancellation of task processing
2022-Sep-30 23:59:04 :: [riscv64] build FAILED
2022-Sep-30 23:59:04 :: task #24322 for sisyphus_riscv64 FAILED

More information about the Riscv-reports mailing list