[riscv-reports] [#25672] [test-only] FAILED srpm=llvm15.0-15.0.0-alt0.1.rv64.src.rpm

Girar awaiter robot awaiter at gyle-riscv.office.basealt.ru
Sun Nov 6 11:07:57 MSK 2022


http://git.altlinux.org/tasks/25672/logs/events.1.1.log

2022-Nov-05 09:01:22 :: test-only task #25672 for sisyphus_riscv64 started by iv:
#100 build llvm15.0-15.0.0-alt0.1.rv64.src.rpm
2022-Nov-05 09:01:35 :: [riscv64] #100 llvm15.0-15.0.0-alt0.1.rv64.src.rpm: build start
./gb-remote-log: line 112: cannot create temp file for here-document: No space left on device
./gb-remote-log: line 123: cannot create temp file for here-document: No space left on device
FAILED: CMakeFiles/install.util 
cd /usr/src/RPM/BUILD/llvm-project/riscv64-alt-linux && /usr/bin/cmake -P cmake_install.cmake
ninja: build stopped: subcommand failed.
error: Bad exit status from /usr/src/tmp/rpm-tmp.6304 (%install)
RPM build errors:
    Bad exit status from /usr/src/tmp/rpm-tmp.6304 (%install)
Command exited with non-zero status 1
305214.42user 17306.19system 23:00:58elapsed 389%CPU (0avgtext+0avgdata 3729632maxresident)k
26013376inputs+0outputs (99131major+605050242minor)pagefaults 0swaps
hsh-rebuild: rebuild of `llvm15.0-15.0.0-alt0.1.rv64.src.rpm' failed.
2022-Nov-06 08:07:52 :: [riscv64] llvm15.0-15.0.0-alt0.1.rv64.src.rpm: remote: build failed
2022-Nov-06 08:07:52 :: [riscv64] #100 llvm15.0-15.0.0-alt0.1.rv64.src.rpm: build FAILED
2022-Nov-06 08:07:57 :: [riscv64] requesting cancellation of task processing
2022-Nov-06 08:07:57 :: [riscv64] build FAILED
2022-Nov-06 08:07:57 :: task #25672 for sisyphus_riscv64 FAILED


More information about the Riscv-reports mailing list