[riscv-reports] [#15535] [test-only] FAILED (try 15) srpm=ruby-2.7.5-alt1.src.rpm srpm=gem-setup-5.999.5-alt11.src.rpm ...

Girar awaiter robot awaiter at gyle-riscv.office.basealt.ru
Fri Jan 21 17:27:40 MSK 2022


http://git.altlinux.org/tasks/15535/logs/events.15.1.log

2022-Jan-21 14:11:06 :: test-only task #15535 for sisyphus_riscv64 resumed by iv:
#100 build ruby-2.7.5-alt1.src.rpm
#200 build gem-setup-5.999.5-alt11.src.rpm
#300 build gem-rake-13.0.5-alt1.src.rpm
#400 build gem-rspec-support-3.10.2-alt1.src.rpm
#500 build gem-hoe-3.22.1-alt1.src.rpm
#600 build gem-rspec-expectations-3.10.1-alt1.src.rpm
#700 build gem-rspec-core-3.10.1-alt1.src.rpm
#1000 build gem-diff-lcs-1.4.3-alt1.src.rpm
#1100 build gem-rspec-mocks-3.10.2-alt1.src.rpm
#1200 build gem-rspec-3.10.0-alt1.src.rpm
#1300 build gem-asciidoctor-2.0.16-alt0.1.re.rv64.src.rpm
#1400 build gem-ast-2.4.1-alt0.1.re.rv64.src.rpm
#1500 build gem-bacon-1.2.0-alt0.1.re.rv64.src.rpm
#1600 build gem-benchmark-ips-2.9.1-alt0.1.re.rv64.src.rpm
#1700 build gem-builder-3.2.4-alt0.1.re.rv64.src.rpm
#2000 build gem-cliver-0.3.2-alt0.1.re.rv64.src.rpm
#2100 build gem-coderay-1.1.3-alt0.1.re.rv64.src.rpm
#2200 build gem-coffee-script-2.4.1.1-alt0.1.re.rv64.src.rpm
#2300 build gem-coffee-script-source-2.1.1-alt0.2.1.re.rv64.src.rpm
#2400 build gem-coffee-script-source-compat-1.12.2-alt0.3.re.rv64.src.rpm
#2500 build gem-commonjs-0.2.7.1-alt0.0.1.re.rv64.src.rpm
#2600 build gem-connection-pool-2.2.5-alt0.1.re.rv64.src.rpm
#2700 build gem-coveralls-0.8.23.1-alt0.0.1.re.rv64.src.rpm
#3000 build gem-crass-1.0.5-alt0.1.re.rv64.src.rpm
#3100 build gem-creole-0.5.0.1-alt0.0.1.re.rv64.src.rpm
#3200 build gem-docile-1.3.5-alt0.1.re.rv64.src.rpm
#3300 build gem-erubi-1.10.0-alt0.1.re.rv64.src.rpm
#3400 build gem-erubis-2.7.0-alt0.5.re.rv64.src.rpm
#3500 build gem-execjs-2.7.0.1-alt0.0.1.re.rv64.src.rpm
#3600 build gem-expression-parser-0.9.1-alt0.1.1.re.rv64.src.rpm
#3700 build gem-gauntlet-2.1.0-alt0.1.re.rv64.src.rpm
#4000 build gem-gettext-3.3.5-alt0.1.re.rv64.src.rpm
#4100 build gem-globalid-0.4.2-alt0.1.re.rv64.src.rpm
#4200 build gem-haml-5.2.2-alt0.1.re.rv64.src.rpm
#4300 build gem-hansi-0.2.0-alt0.1.re.rv64.src.rpm
#4400 build gem-htmlentities-4.3.3-alt0.1.1.re.rv64.src.rpm
#4500 build gem-i18n-1.8.3-alt0.1.re.rv64.src.rpm
#4600 build gem-kramdown-2.3.1-alt0.3.re.rv64.src.rpm
#4700 build gem-less-2.6.0-alt0.2.re.rv64.src.rpm
#5000 build gem-liquid-5.0.1-alt0.1.re.rv64.src.rpm
#5100 build gem-locale-2.1.3-alt0.1.re.rv64.src.rpm
#5200 build gem-loofah-2.12.0-alt0.1.re.rv64.src.rpm
#5300 build gem-mail-2.7.1.1-alt0.0.1.re.rv64.src.rpm
#5400 build gem-marcel-1.0.1-alt0.1.re.rv64.src.rpm
#5500 build gem-markaby-0.9.0.1-alt0.0.1.re.rv64.src.rpm
#5600 build gem-method-source-1.0.0-alt0.1.re.rv64.src.rpm
#5700 build gem-mimemagic-0.3.5-alt0.1.re.rv64.src.rpm
#6000 build gem-mini-mime-1.1.0-alt0.1.re.rv64.src.rpm
#6100 build gem-minitest-5.14.4-alt0.1.re.rv64.src.rpm
#6200 build gem-minitest-global-expectations-1.0.1-alt0.1.re.rv64.src.rpm
#6300 build gem-mocha-1.11.2-alt0.1.re.rv64.src.rpm
#6400 build gem-multi-json-1.15.0-alt0.1.re.rv64.src.rpm
#6500 build gem-mustermann-1.1.1-alt0.1.1.re.rv64.src.rpm
#6600 build gem-net-http-persistent-4.0.0-alt0.1.re.rv64.src.rpm
#6700 build gem-packnga-1.0.4-alt0.1.re.rv64.src.rpm
#7000 build gem-parallel-1.20.2-alt0.1.re.rv64.src.rpm
#7100 build gem-parser-3.0.1.1-alt0.1.re.rv64.src.rpm
#7200 build gem-permessage-deflate-0.1.4-alt0.1.re.rv64.src.rpm
#7300 build gem-power-assert-1.1.7-alt0.1.re.rv64.src.rpm
#7400 removed
#7500 build gem-pry-0.14.1-alt0.1.re.rv64.src.rpm
#7600 build gem-rack-2.2.2-alt0.1.re.rv64.src.rpm
#7700 build gem-rack-test-1.1.0.1-alt0.1.re.rv64.src.rpm
#10000 build gem-radius-0.8.0-alt0.0.1.re.rv64.src.rpm
#10100 removed
#10200 build gem-rails-dom-testing-2.0.3-alt0.2.re.rv64.src.rpm
#10300 build gem-rails-html-sanitizer-1.3.0-alt0.1.re.rv64.src.rpm
#10400 build gem-rainbow-3.1.0-alt0.1.re.rv64.src.rpm
#10500 build gem-rbench-0.2.4-alt0.1.re.rv64.src.rpm
#10600 build gem-rb-fsevent-0.11.0-alt0.1.re.rv64.src.rpm
#10700 build gem-rb-inotify-0.10.1-alt0.1.re.rv64.src.rpm
#11000 build gem-redcloth-4.3.2-alt0.3.re.rv64.src.rpm
#11100 build gem-regexp-parser-1.8.2-alt0.1.re.rv64.src.rpm
#11200 build gem-rexml-3.2.5-alt0.1.re.rv64.src.rpm
#11300 build gem-rouge-3.26.0-alt0.1.re.rv64.src.rpm
#11400 build gem-rr-3.0.4-alt0.1.re.rv64.src.rpm
#11500 build gem-rubocop-1.15.0-alt0.1.re.rv64.src.rpm
#11600 build gem-rubocop-ast-1.7.0-alt0.1.re.rv64.src.rpm
#11700 build gem-rubocop-discourse-2.4.2-alt0.1.re.rv64.src.rpm
#12000 build gem-rubocop-performance-1.11.3-alt0.1.re.rv64.src.rpm
#12100 build gem-rubocop-rspec-2.4.0-alt0.1.re.rv64.src.rpm
#12200 build gem-ruby2-keywords-0.0.4-alt0.1.re.rv64.src.rpm
#12300 removed
#12400 build gem-sass-3.7.4-alt0.2.1.re.rv64.src.rpm
#12500 build gem-sass-listen-4.0.0-alt0.3.re.rv64.src.rpm
#12600 build gem-simplecov-0.21.2-alt0.1.re.rv64.src.rpm
#12700 build gem-simplecov-html-0.12.3-alt0.1.re.rv64.src.rpm
#13000 build gem-simplecov-json-formatter-0.1.2-alt0.1.re.rv64.src.rpm
#13100 build gem-sinatra-2.1.0-alt0.1.re.rv64.src.rpm
#13200 build gem-slim-4.1.0-alt0.1.re.rv64.src.rpm
#13300 build gem-sprockets-4.0.2.1-alt0.1.re.rv64.src.rpm
#13400 build gem-sprockets-rails-3.2.2-alt0.1.re.rv64.src.rpm
#13500 build gem-stringex-2.8.5-alt0.1.re.rv64.src.rpm
#13600 build gem-temple-0.8.2-alt0.1.re.rv64.src.rpm
#13700 build gem-test-unit-3.3.5-alt0.1.re.rv64.src.rpm
#14000 build gem-text-1.3.1-alt0.5.re.rv64.src.rpm
#14100 removed
#14200 build gem-tilt-2.0.10.1-alt0.1.re.rv64.src.rpm
#14300 build gem-twitter-text-3.1.0-alt0.1.re.rv64.src.rpm
#14400 build gem-tzinfo-2.0.4-alt0.1.re.rv64.src.rpm
#14500 build gem-unf-0.2.0-alt0.0.1.re.rv64.src.rpm
#14600 build gem-unicode-display-width-2.0.0-alt0.1.re.rv64.src.rpm
#14700 build gem-websocket-extensions-0.1.5-alt0.1.re.rv64.src.rpm
#15000 build gem-wikicloth-0.8.3.1-alt0.1.re.rv64.src.rpm
#15100 build gem-yard-0.9.25-alt0.1.re.rv64.src.rpm
#15200 build gem-zeitwerk-2.4.2-alt0.1.re.rv64.src.rpm
#15300 build ruby-timecop-0.9.1-alt0.1.re.rv64.src.rpm
#15400 delete ruby-hpricot
#15500 delete ruby-ldap
#15600 delete ruby-nokogiri
#15700 delete ruby-racc
#16000 delete ruby-hoe
#16100 delete ruby-bundler
#16200 delete ruby-coderay
#16300 delete ruby-concourse
#16400 delete ruby-method_source
#16500 delete ruby-mini_portile2
#16600 delete ruby-minitest
#16700 delete ruby-net-telnet
#17000 delete ruby-pkg-config
#17100 delete ruby-pry
#17200 delete ruby-rake
#17300 delete ruby-rdoc
#17400 delete ruby-rexical
#17500 delete ruby-rubygems-update
#17600 delete ruby-slop3
#17700 delete ruby-term-ansicolor
#20000 delete ruby-test-unit
#20100 delete ruby-tins
#20200 delete ruby-tool-setup
#20300 delete ruby-xmlrpc
#20400 build gem-rdoc-6.3.0-alt1.src.rpm
#20500 build gem-thor-1.0.1-alt1.src.rpm
#20600 removed
#20700 removed
#21000 build libcaca-0.99-alt22.src.rpm
#21100 build xapian-bindings-1.4.15-alt3.src.rpm
#21200 removed
#21300 removed
#21400 removed
#21500 removed
#21600 build gem-nio4r-2.5.2-alt1.src.rpm
#21700 build gem-redcarpet-3.5.0-alt1.src.rpm
#22000 build gem-rake-compiler-dock-1.1.0-alt1.src.rpm
#22100 build gem-json-2.5.1-alt1.src.rpm
#22200 build gem-concurrent-ruby-1.1.7-alt2.src.rpm
#22300 build gem-hoe-markdown-1.4.0-alt1.src.rpm
#22400 build gem-oj-3.10.5-alt1.1.src.rpm
#22500 build gem-idn-ruby-0.1.0-alt2.1.src.rpm
#22600 build gem-rake-compiler-1.1.2-alt1.src.rpm
#22700 removed
#23000 build gem-ffi-1.15.4-alt1.src.rpm
#23100 build gem-yajl-ruby-1.4.1-alt3.src.rpm
#23200 build gem-eventmachine-1.3.0.dev.1-alt1.src.rpm
#23300 build gem-websocket-driver-0.7.5-alt1.src.rpm
#23400 removed
#23500 build gem-gem-hadar-1.11.0-alt1.src.rpm
#23600 build gem-term-ansicolor-1.7.1-alt1.1.src.rpm
#23700 build gem-xmlrpc-0.3.2-alt1.src.rpm
#24000 build gem-webrick-1.7.0-alt1.src.rpm
#24100 build gem-mspec-1.8.0-alt1.src.rpm
#24200 build gem-net-telnet-0.2.0.1-alt0.1.src.rpm
#24300 removed
#24400 build gem-hpricot-0.8.6-alt4.3.src.rpm
#24500 build gem-sync-0.5.0-alt1.src.rpm
#24600 build gem-tins-1.29.0-alt1.src.rpm
#24700 build gem-progressbar-1.10.1-alt1.1.src.rpm
#25000 build gem-ruby-ldap-0.9.20-alt4.2.src.rpm
#25100 removed
#25200 build gem-activesupport-6.1.4.1-alt0.2.re.rv64.src.rpm
#25300 delete ronn
#25400 delete rdiscount
#25500 build gem-rubygems-update-3.2.19-alt1.src.rpm
#25600 build gem-nokogiri-1.12.5-alt1.src.rpm
genpkglist: mcdb_put: can't set data to memcached 48
2022-Jan-21 14:11:13 :: created build repo
2022-Jan-21 14:11:16 :: [riscv64] #100 ruby-2.7.5-alt1.src.rpm: build start
2022-Jan-21 14:11:18 :: [riscv64] ruby-2.7.5-alt1.src.rpm: remote: too swift to rebuild
2022-Jan-21 14:11:18 :: [riscv64] #100 ruby-2.7.5-alt1.src.rpm: build swiftly SKIPPED
2022-Jan-21 14:11:18 :: [riscv64] #200 gem-setup-5.999.5-alt11.src.rpm: build start
2022-Jan-21 14:11:18 :: [riscv64] gem-setup-5.999.5-alt11.src.rpm: remote: too swift to rebuild
2022-Jan-21 14:11:19 :: [riscv64] #200 gem-setup-5.999.5-alt11.src.rpm: build swiftly SKIPPED
2022-Jan-21 14:11:19 :: [riscv64] #300 gem-rake-13.0.5-alt1.src.rpm: build start
2022-Jan-21 14:11:19 :: [riscv64] gem-rake-13.0.5-alt1.src.rpm: remote: too swift to rebuild
2022-Jan-21 14:11:19 :: [riscv64] #300 gem-rake-13.0.5-alt1.src.rpm: build swiftly SKIPPED
2022-Jan-21 14:11:19 :: [riscv64] #400 gem-rspec-support-3.10.2-alt1.src.rpm: build start
2022-Jan-21 14:11:19 :: [riscv64] gem-rspec-support-3.10.2-alt1.src.rpm: remote: too swift to rebuild
2022-Jan-21 14:11:19 :: [riscv64] #400 gem-rspec-support-3.10.2-alt1.src.rpm: build swiftly SKIPPED
2022-Jan-21 14:11:19 :: [riscv64] #500 gem-hoe-3.22.1-alt1.src.rpm: build start
2022-Jan-21 14:11:19 :: [riscv64] gem-hoe-3.22.1-alt1.src.rpm: remote: too swift to rebuild
2022-Jan-21 14:11:19 :: [riscv64] #500 gem-hoe-3.22.1-alt1.src.rpm: build swiftly SKIPPED
2022-Jan-21 14:11:19 :: [riscv64] #600 gem-rspec-expectations-3.10.1-alt1.src.rpm: build start
2022-Jan-21 14:11:19 :: [riscv64] gem-rspec-expectations-3.10.1-alt1.src.rpm: remote: too swift to rebuild
2022-Jan-21 14:11:19 :: [riscv64] #600 gem-rspec-expectations-3.10.1-alt1.src.rpm: build swiftly SKIPPED
2022-Jan-21 14:11:19 :: [riscv64] #700 gem-rspec-core-3.10.1-alt1.src.rpm: build start
2022-Jan-21 14:11:19 :: [riscv64] gem-rspec-core-3.10.1-alt1.src.rpm: remote: too swift to rebuild
2022-Jan-21 14:11:19 :: [riscv64] #700 gem-rspec-core-3.10.1-alt1.src.rpm: build swiftly SKIPPED
2022-Jan-21 14:11:19 :: [riscv64] #1000 gem-diff-lcs-1.4.3-alt1.src.rpm: build start
2022-Jan-21 14:11:20 :: [riscv64] gem-diff-lcs-1.4.3-alt1.src.rpm: remote: too swift to rebuild
2022-Jan-21 14:11:20 :: [riscv64] #1000 gem-diff-lcs-1.4.3-alt1.src.rpm: build swiftly SKIPPED
2022-Jan-21 14:11:20 :: [riscv64] #1100 gem-rspec-mocks-3.10.2-alt1.src.rpm: build start
2022-Jan-21 14:11:20 :: [riscv64] gem-rspec-mocks-3.10.2-alt1.src.rpm: remote: too swift to rebuild
2022-Jan-21 14:11:20 :: [riscv64] #1100 gem-rspec-mocks-3.10.2-alt1.src.rpm: build swiftly SKIPPED
2022-Jan-21 14:11:20 :: [riscv64] #1200 gem-rspec-3.10.0-alt1.src.rpm: build start
2022-Jan-21 14:11:20 :: [riscv64] gem-rspec-3.10.0-alt1.src.rpm: remote: too swift to rebuild
2022-Jan-21 14:11:20 :: [riscv64] #1200 gem-rspec-3.10.0-alt1.src.rpm: build swiftly SKIPPED
2022-Jan-21 14:11:20 :: [riscv64] #1300 gem-asciidoctor-2.0.16-alt0.1.re.rv64.src.rpm: build start
2022-Jan-21 14:11:20 :: [riscv64] gem-asciidoctor-2.0.16-alt0.1.re.rv64.src.rpm: remote: too swift to rebuild
2022-Jan-21 14:11:20 :: [riscv64] #1300 gem-asciidoctor-2.0.16-alt0.1.re.rv64.src.rpm: build swiftly SKIPPED
2022-Jan-21 14:11:20 :: [riscv64] #1400 gem-ast-2.4.1-alt0.1.re.rv64.src.rpm: build start
2022-Jan-21 14:11:20 :: [riscv64] gem-ast-2.4.1-alt0.1.re.rv64.src.rpm: remote: too swift to rebuild
2022-Jan-21 14:11:20 :: [riscv64] #1400 gem-ast-2.4.1-alt0.1.re.rv64.src.rpm: build swiftly SKIPPED
2022-Jan-21 14:11:20 :: [riscv64] #1500 gem-bacon-1.2.0-alt0.1.re.rv64.src.rpm: build start
2022-Jan-21 14:11:20 :: [riscv64] gem-bacon-1.2.0-alt0.1.re.rv64.src.rpm: remote: too swift to rebuild
2022-Jan-21 14:11:20 :: [riscv64] #1500 gem-bacon-1.2.0-alt0.1.re.rv64.src.rpm: build swiftly SKIPPED
2022-Jan-21 14:11:20 :: [riscv64] #1600 gem-benchmark-ips-2.9.1-alt0.1.re.rv64.src.rpm: build start
2022-Jan-21 14:11:21 :: [riscv64] gem-benchmark-ips-2.9.1-alt0.1.re.rv64.src.rpm: remote: too swift to rebuild
2022-Jan-21 14:11:21 :: [riscv64] #1600 gem-benchmark-ips-2.9.1-alt0.1.re.rv64.src.rpm: build swiftly SKIPPED
2022-Jan-21 14:11:21 :: [riscv64] #1700 gem-builder-3.2.4-alt0.1.re.rv64.src.rpm: build start
2022-Jan-21 14:11:21 :: [riscv64] gem-builder-3.2.4-alt0.1.re.rv64.src.rpm: remote: too swift to rebuild
2022-Jan-21 14:11:21 :: [riscv64] #1700 gem-builder-3.2.4-alt0.1.re.rv64.src.rpm: build swiftly SKIPPED
2022-Jan-21 14:11:21 :: [riscv64] #2000 gem-cliver-0.3.2-alt0.1.re.rv64.src.rpm: build start
2022-Jan-21 14:11:21 :: [riscv64] gem-cliver-0.3.2-alt0.1.re.rv64.src.rpm: remote: too swift to rebuild
2022-Jan-21 14:11:21 :: [riscv64] #2000 gem-cliver-0.3.2-alt0.1.re.rv64.src.rpm: build swiftly SKIPPED
2022-Jan-21 14:11:21 :: [riscv64] #2100 gem-coderay-1.1.3-alt0.1.re.rv64.src.rpm: build start
2022-Jan-21 14:11:21 :: [riscv64] gem-coderay-1.1.3-alt0.1.re.rv64.src.rpm: remote: too swift to rebuild
2022-Jan-21 14:11:21 :: [riscv64] #2100 gem-coderay-1.1.3-alt0.1.re.rv64.src.rpm: build swiftly SKIPPED
2022-Jan-21 14:11:21 :: [riscv64] #2200 gem-coffee-script-2.4.1.1-alt0.1.re.rv64.src.rpm: build start
2022-Jan-21 14:11:21 :: [riscv64] gem-coffee-script-2.4.1.1-alt0.1.re.rv64.src.rpm: remote: too swift to rebuild
2022-Jan-21 14:11:21 :: [riscv64] #2200 gem-coffee-script-2.4.1.1-alt0.1.re.rv64.src.rpm: build swiftly SKIPPED
2022-Jan-21 14:11:21 :: [riscv64] #2300 gem-coffee-script-source-2.1.1-alt0.2.1.re.rv64.src.rpm: build start
2022-Jan-21 14:11:21 :: [riscv64] gem-coffee-script-source-2.1.1-alt0.2.1.re.rv64.src.rpm: remote: too swift to rebuild
2022-Jan-21 14:11:21 :: [riscv64] #2300 gem-coffee-script-source-2.1.1-alt0.2.1.re.rv64.src.rpm: build swiftly SKIPPED
2022-Jan-21 14:11:21 :: [riscv64] #2400 gem-coffee-script-source-compat-1.12.2-alt0.3.re.rv64.src.rpm: build start
2022-Jan-21 14:11:22 :: [riscv64] gem-coffee-script-source-compat-1.12.2-alt0.3.re.rv64.src.rpm: remote: too swift to rebuild
2022-Jan-21 14:11:22 :: [riscv64] #2400 gem-coffee-script-source-compat-1.12.2-alt0.3.re.rv64.src.rpm: build swiftly SKIPPED
2022-Jan-21 14:11:22 :: [riscv64] #2500 gem-commonjs-0.2.7.1-alt0.0.1.re.rv64.src.rpm: build start
2022-Jan-21 14:11:22 :: [riscv64] gem-commonjs-0.2.7.1-alt0.0.1.re.rv64.src.rpm: remote: too swift to rebuild
2022-Jan-21 14:11:22 :: [riscv64] #2500 gem-commonjs-0.2.7.1-alt0.0.1.re.rv64.src.rpm: build swiftly SKIPPED
2022-Jan-21 14:11:22 :: [riscv64] #2600 gem-connection-pool-2.2.5-alt0.1.re.rv64.src.rpm: build start
2022-Jan-21 14:11:22 :: [riscv64] gem-connection-pool-2.2.5-alt0.1.re.rv64.src.rpm: remote: too swift to rebuild
2022-Jan-21 14:11:22 :: [riscv64] #2600 gem-connection-pool-2.2.5-alt0.1.re.rv64.src.rpm: build swiftly SKIPPED
2022-Jan-21 14:11:22 :: [riscv64] #2700 gem-coveralls-0.8.23.1-alt0.0.1.re.rv64.src.rpm: build start
2022-Jan-21 14:11:22 :: [riscv64] gem-coveralls-0.8.23.1-alt0.0.1.re.rv64.src.rpm: remote: too swift to rebuild
2022-Jan-21 14:11:22 :: [riscv64] #2700 gem-coveralls-0.8.23.1-alt0.0.1.re.rv64.src.rpm: build swiftly SKIPPED
2022-Jan-21 14:11:22 :: [riscv64] #3000 gem-crass-1.0.5-alt0.1.re.rv64.src.rpm: build start
2022-Jan-21 14:11:22 :: [riscv64] gem-crass-1.0.5-alt0.1.re.rv64.src.rpm: remote: too swift to rebuild
2022-Jan-21 14:11:22 :: [riscv64] #3000 gem-crass-1.0.5-alt0.1.re.rv64.src.rpm: build swiftly SKIPPED
2022-Jan-21 14:11:22 :: [riscv64] #3100 gem-creole-0.5.0.1-alt0.0.1.re.rv64.src.rpm: build start
2022-Jan-21 14:11:22 :: [riscv64] gem-creole-0.5.0.1-alt0.0.1.re.rv64.src.rpm: remote: too swift to rebuild
2022-Jan-21 14:11:22 :: [riscv64] #3100 gem-creole-0.5.0.1-alt0.0.1.re.rv64.src.rpm: build swiftly SKIPPED
2022-Jan-21 14:11:22 :: [riscv64] #3200 gem-docile-1.3.5-alt0.1.re.rv64.src.rpm: build start
2022-Jan-21 14:11:22 :: [riscv64] gem-docile-1.3.5-alt0.1.re.rv64.src.rpm: remote: too swift to rebuild
2022-Jan-21 14:11:22 :: [riscv64] #3200 gem-docile-1.3.5-alt0.1.re.rv64.src.rpm: build swiftly SKIPPED
2022-Jan-21 14:11:22 :: [riscv64] #3300 gem-erubi-1.10.0-alt0.1.re.rv64.src.rpm: build start
2022-Jan-21 14:11:23 :: [riscv64] gem-erubi-1.10.0-alt0.1.re.rv64.src.rpm: remote: too swift to rebuild
2022-Jan-21 14:11:23 :: [riscv64] #3300 gem-erubi-1.10.0-alt0.1.re.rv64.src.rpm: build swiftly SKIPPED
2022-Jan-21 14:11:23 :: [riscv64] #3400 gem-erubis-2.7.0-alt0.5.re.rv64.src.rpm: build start
2022-Jan-21 14:11:23 :: [riscv64] gem-erubis-2.7.0-alt0.5.re.rv64.src.rpm: remote: too swift to rebuild
2022-Jan-21 14:11:23 :: [riscv64] #3400 gem-erubis-2.7.0-alt0.5.re.rv64.src.rpm: build swiftly SKIPPED
2022-Jan-21 14:11:23 :: [riscv64] #3500 gem-execjs-2.7.0.1-alt0.0.1.re.rv64.src.rpm: build start
2022-Jan-21 14:11:23 :: [riscv64] gem-execjs-2.7.0.1-alt0.0.1.re.rv64.src.rpm: remote: too swift to rebuild
2022-Jan-21 14:11:23 :: [riscv64] #3500 gem-execjs-2.7.0.1-alt0.0.1.re.rv64.src.rpm: build swiftly SKIPPED
2022-Jan-21 14:11:23 :: [riscv64] #3600 gem-expression-parser-0.9.1-alt0.1.1.re.rv64.src.rpm: build start
2022-Jan-21 14:11:23 :: [riscv64] gem-expression-parser-0.9.1-alt0.1.1.re.rv64.src.rpm: remote: too swift to rebuild
2022-Jan-21 14:11:23 :: [riscv64] #3600 gem-expression-parser-0.9.1-alt0.1.1.re.rv64.src.rpm: build swiftly SKIPPED
2022-Jan-21 14:11:23 :: [riscv64] #3700 gem-gauntlet-2.1.0-alt0.1.re.rv64.src.rpm: build start
2022-Jan-21 14:11:23 :: [riscv64] gem-gauntlet-2.1.0-alt0.1.re.rv64.src.rpm: remote: too swift to rebuild
2022-Jan-21 14:11:23 :: [riscv64] #3700 gem-gauntlet-2.1.0-alt0.1.re.rv64.src.rpm: build swiftly SKIPPED
2022-Jan-21 14:11:23 :: [riscv64] #4000 gem-gettext-3.3.5-alt0.1.re.rv64.src.rpm: build start
2022-Jan-21 14:11:23 :: [riscv64] gem-gettext-3.3.5-alt0.1.re.rv64.src.rpm: remote: too swift to rebuild
2022-Jan-21 14:11:23 :: [riscv64] #4000 gem-gettext-3.3.5-alt0.1.re.rv64.src.rpm: build swiftly SKIPPED
2022-Jan-21 14:11:23 :: [riscv64] #4100 gem-globalid-0.4.2-alt0.1.re.rv64.src.rpm: build start
2022-Jan-21 14:11:24 :: [riscv64] gem-globalid-0.4.2-alt0.1.re.rv64.src.rpm: remote: too swift to rebuild
2022-Jan-21 14:11:24 :: [riscv64] #4100 gem-globalid-0.4.2-alt0.1.re.rv64.src.rpm: build swiftly SKIPPED
2022-Jan-21 14:11:24 :: [riscv64] #4200 gem-haml-5.2.2-alt0.1.re.rv64.src.rpm: build start
2022-Jan-21 14:11:24 :: [riscv64] gem-haml-5.2.2-alt0.1.re.rv64.src.rpm: remote: too swift to rebuild
2022-Jan-21 14:11:24 :: [riscv64] #4200 gem-haml-5.2.2-alt0.1.re.rv64.src.rpm: build swiftly SKIPPED
2022-Jan-21 14:11:24 :: [riscv64] #4300 gem-hansi-0.2.0-alt0.1.re.rv64.src.rpm: build start
2022-Jan-21 14:11:24 :: [riscv64] gem-hansi-0.2.0-alt0.1.re.rv64.src.rpm: remote: too swift to rebuild
2022-Jan-21 14:11:24 :: [riscv64] #4300 gem-hansi-0.2.0-alt0.1.re.rv64.src.rpm: build swiftly SKIPPED
2022-Jan-21 14:11:24 :: [riscv64] #4400 gem-htmlentities-4.3.3-alt0.1.1.re.rv64.src.rpm: build start
2022-Jan-21 14:11:24 :: [riscv64] gem-htmlentities-4.3.3-alt0.1.1.re.rv64.src.rpm: remote: too swift to rebuild
2022-Jan-21 14:11:24 :: [riscv64] #4400 gem-htmlentities-4.3.3-alt0.1.1.re.rv64.src.rpm: build swiftly SKIPPED
2022-Jan-21 14:11:24 :: [riscv64] #4500 gem-i18n-1.8.3-alt0.1.re.rv64.src.rpm: build start
2022-Jan-21 14:11:24 :: [riscv64] gem-i18n-1.8.3-alt0.1.re.rv64.src.rpm: remote: too swift to rebuild
2022-Jan-21 14:11:24 :: [riscv64] #4500 gem-i18n-1.8.3-alt0.1.re.rv64.src.rpm: build swiftly SKIPPED
2022-Jan-21 14:11:24 :: [riscv64] #4600 gem-kramdown-2.3.1-alt0.3.re.rv64.src.rpm: build start
2022-Jan-21 14:11:24 :: [riscv64] gem-kramdown-2.3.1-alt0.3.re.rv64.src.rpm: remote: too swift to rebuild
2022-Jan-21 14:11:24 :: [riscv64] #4600 gem-kramdown-2.3.1-alt0.3.re.rv64.src.rpm: build swiftly SKIPPED
2022-Jan-21 14:11:24 :: [riscv64] #4700 gem-less-2.6.0-alt0.2.re.rv64.src.rpm: build start
2022-Jan-21 14:11:24 :: [riscv64] gem-less-2.6.0-alt0.2.re.rv64.src.rpm: remote: too swift to rebuild
2022-Jan-21 14:11:25 :: [riscv64] #4700 gem-less-2.6.0-alt0.2.re.rv64.src.rpm: build swiftly SKIPPED
2022-Jan-21 14:11:25 :: [riscv64] #5000 gem-liquid-5.0.1-alt0.1.re.rv64.src.rpm: build start
2022-Jan-21 14:11:25 :: [riscv64] gem-liquid-5.0.1-alt0.1.re.rv64.src.rpm: remote: too swift to rebuild
2022-Jan-21 14:11:25 :: [riscv64] #5000 gem-liquid-5.0.1-alt0.1.re.rv64.src.rpm: build swiftly SKIPPED
2022-Jan-21 14:11:25 :: [riscv64] #5100 gem-locale-2.1.3-alt0.1.re.rv64.src.rpm: build start
2022-Jan-21 14:11:25 :: [riscv64] gem-locale-2.1.3-alt0.1.re.rv64.src.rpm: remote: too swift to rebuild
2022-Jan-21 14:11:25 :: [riscv64] #5100 gem-locale-2.1.3-alt0.1.re.rv64.src.rpm: build swiftly SKIPPED
2022-Jan-21 14:11:25 :: [riscv64] #5200 gem-loofah-2.12.0-alt0.1.re.rv64.src.rpm: build start
2022-Jan-21 14:11:25 :: [riscv64] gem-loofah-2.12.0-alt0.1.re.rv64.src.rpm: remote: too swift to rebuild
2022-Jan-21 14:11:25 :: [riscv64] #5200 gem-loofah-2.12.0-alt0.1.re.rv64.src.rpm: build swiftly SKIPPED
2022-Jan-21 14:11:25 :: [riscv64] #5300 gem-mail-2.7.1.1-alt0.0.1.re.rv64.src.rpm: build start
2022-Jan-21 14:11:25 :: [riscv64] gem-mail-2.7.1.1-alt0.0.1.re.rv64.src.rpm: remote: too swift to rebuild
2022-Jan-21 14:11:25 :: [riscv64] #5300 gem-mail-2.7.1.1-alt0.0.1.re.rv64.src.rpm: build swiftly SKIPPED
2022-Jan-21 14:11:25 :: [riscv64] #5400 gem-marcel-1.0.1-alt0.1.re.rv64.src.rpm: build start
2022-Jan-21 14:11:26 :: [riscv64] gem-marcel-1.0.1-alt0.1.re.rv64.src.rpm: remote: too swift to rebuild
2022-Jan-21 14:11:26 :: [riscv64] #5400 gem-marcel-1.0.1-alt0.1.re.rv64.src.rpm: build swiftly SKIPPED
2022-Jan-21 14:11:26 :: [riscv64] #5500 gem-markaby-0.9.0.1-alt0.0.1.re.rv64.src.rpm: build start
2022-Jan-21 14:11:26 :: [riscv64] gem-markaby-0.9.0.1-alt0.0.1.re.rv64.src.rpm: remote: too swift to rebuild
2022-Jan-21 14:11:26 :: [riscv64] #5500 gem-markaby-0.9.0.1-alt0.0.1.re.rv64.src.rpm: build swiftly SKIPPED
2022-Jan-21 14:11:26 :: [riscv64] #5600 gem-method-source-1.0.0-alt0.1.re.rv64.src.rpm: build start
2022-Jan-21 14:11:26 :: [riscv64] gem-method-source-1.0.0-alt0.1.re.rv64.src.rpm: remote: too swift to rebuild
2022-Jan-21 14:11:26 :: [riscv64] #5600 gem-method-source-1.0.0-alt0.1.re.rv64.src.rpm: build swiftly SKIPPED
2022-Jan-21 14:11:26 :: [riscv64] #5700 gem-mimemagic-0.3.5-alt0.1.re.rv64.src.rpm: build start
2022-Jan-21 14:11:27 :: [riscv64] gem-mimemagic-0.3.5-alt0.1.re.rv64.src.rpm: remote: too swift to rebuild
2022-Jan-21 14:11:27 :: [riscv64] #5700 gem-mimemagic-0.3.5-alt0.1.re.rv64.src.rpm: build swiftly SKIPPED
2022-Jan-21 14:11:27 :: [riscv64] #6000 gem-mini-mime-1.1.0-alt0.1.re.rv64.src.rpm: build start
2022-Jan-21 14:11:27 :: [riscv64] gem-mini-mime-1.1.0-alt0.1.re.rv64.src.rpm: remote: too swift to rebuild
2022-Jan-21 14:11:27 :: [riscv64] #6000 gem-mini-mime-1.1.0-alt0.1.re.rv64.src.rpm: build swiftly SKIPPED
2022-Jan-21 14:11:27 :: [riscv64] #6100 gem-minitest-5.14.4-alt0.1.re.rv64.src.rpm: build start
2022-Jan-21 14:11:27 :: [riscv64] gem-minitest-5.14.4-alt0.1.re.rv64.src.rpm: remote: too swift to rebuild
2022-Jan-21 14:11:27 :: [riscv64] #6100 gem-minitest-5.14.4-alt0.1.re.rv64.src.rpm: build swiftly SKIPPED
2022-Jan-21 14:11:27 :: [riscv64] #6200 gem-minitest-global-expectations-1.0.1-alt0.1.re.rv64.src.rpm: build start
2022-Jan-21 14:11:27 :: [riscv64] gem-minitest-global-expectations-1.0.1-alt0.1.re.rv64.src.rpm: remote: too swift to rebuild
2022-Jan-21 14:11:27 :: [riscv64] #6200 gem-minitest-global-expectations-1.0.1-alt0.1.re.rv64.src.rpm: build swiftly SKIPPED
2022-Jan-21 14:11:27 :: [riscv64] #6300 gem-mocha-1.11.2-alt0.1.re.rv64.src.rpm: build start
2022-Jan-21 14:11:27 :: [riscv64] gem-mocha-1.11.2-alt0.1.re.rv64.src.rpm: remote: too swift to rebuild
2022-Jan-21 14:11:27 :: [riscv64] #6300 gem-mocha-1.11.2-alt0.1.re.rv64.src.rpm: build swiftly SKIPPED
2022-Jan-21 14:11:27 :: [riscv64] #6400 gem-multi-json-1.15.0-alt0.1.re.rv64.src.rpm: build start
2022-Jan-21 14:11:27 :: [riscv64] gem-multi-json-1.15.0-alt0.1.re.rv64.src.rpm: remote: too swift to rebuild
2022-Jan-21 14:11:27 :: [riscv64] #6400 gem-multi-json-1.15.0-alt0.1.re.rv64.src.rpm: build swiftly SKIPPED
2022-Jan-21 14:11:27 :: [riscv64] #6500 gem-mustermann-1.1.1-alt0.1.1.re.rv64.src.rpm: build start
2022-Jan-21 14:11:28 :: [riscv64] gem-mustermann-1.1.1-alt0.1.1.re.rv64.src.rpm: remote: too swift to rebuild
2022-Jan-21 14:11:28 :: [riscv64] #6500 gem-mustermann-1.1.1-alt0.1.1.re.rv64.src.rpm: build swiftly SKIPPED
2022-Jan-21 14:11:28 :: [riscv64] #6600 gem-net-http-persistent-4.0.0-alt0.1.re.rv64.src.rpm: build start
2022-Jan-21 14:11:28 :: [riscv64] gem-net-http-persistent-4.0.0-alt0.1.re.rv64.src.rpm: remote: too swift to rebuild
2022-Jan-21 14:11:28 :: [riscv64] #6600 gem-net-http-persistent-4.0.0-alt0.1.re.rv64.src.rpm: build swiftly SKIPPED
2022-Jan-21 14:11:28 :: [riscv64] #6700 gem-packnga-1.0.4-alt0.1.re.rv64.src.rpm: build start
2022-Jan-21 14:11:28 :: [riscv64] gem-packnga-1.0.4-alt0.1.re.rv64.src.rpm: remote: too swift to rebuild
2022-Jan-21 14:11:28 :: [riscv64] #6700 gem-packnga-1.0.4-alt0.1.re.rv64.src.rpm: build swiftly SKIPPED
2022-Jan-21 14:11:28 :: [riscv64] #7000 gem-parallel-1.20.2-alt0.1.re.rv64.src.rpm: build start
2022-Jan-21 14:11:28 :: [riscv64] gem-parallel-1.20.2-alt0.1.re.rv64.src.rpm: remote: too swift to rebuild
2022-Jan-21 14:11:28 :: [riscv64] #7000 gem-parallel-1.20.2-alt0.1.re.rv64.src.rpm: build swiftly SKIPPED
2022-Jan-21 14:11:28 :: [riscv64] #7100 gem-parser-3.0.1.1-alt0.1.re.rv64.src.rpm: build start
2022-Jan-21 14:11:28 :: [riscv64] gem-parser-3.0.1.1-alt0.1.re.rv64.src.rpm: remote: too swift to rebuild
2022-Jan-21 14:11:28 :: [riscv64] #7100 gem-parser-3.0.1.1-alt0.1.re.rv64.src.rpm: build swiftly SKIPPED
2022-Jan-21 14:11:28 :: [riscv64] #7200 gem-permessage-deflate-0.1.4-alt0.1.re.rv64.src.rpm: build start
2022-Jan-21 14:11:28 :: [riscv64] gem-permessage-deflate-0.1.4-alt0.1.re.rv64.src.rpm: remote: too swift to rebuild
2022-Jan-21 14:11:28 :: [riscv64] #7200 gem-permessage-deflate-0.1.4-alt0.1.re.rv64.src.rpm: build swiftly SKIPPED
2022-Jan-21 14:11:28 :: [riscv64] #7300 gem-power-assert-1.1.7-alt0.1.re.rv64.src.rpm: build start
2022-Jan-21 14:11:29 :: [riscv64] gem-power-assert-1.1.7-alt0.1.re.rv64.src.rpm: remote: too swift to rebuild
2022-Jan-21 14:11:29 :: [riscv64] #7300 gem-power-assert-1.1.7-alt0.1.re.rv64.src.rpm: build swiftly SKIPPED
2022-Jan-21 14:11:29 :: [riscv64] #7500 gem-pry-0.14.1-alt0.1.re.rv64.src.rpm: build start
2022-Jan-21 14:11:29 :: [riscv64] gem-pry-0.14.1-alt0.1.re.rv64.src.rpm: remote: too swift to rebuild
2022-Jan-21 14:11:29 :: [riscv64] #7500 gem-pry-0.14.1-alt0.1.re.rv64.src.rpm: build swiftly SKIPPED
2022-Jan-21 14:11:29 :: [riscv64] #7600 gem-rack-2.2.2-alt0.1.re.rv64.src.rpm: build start
2022-Jan-21 14:11:29 :: [riscv64] gem-rack-2.2.2-alt0.1.re.rv64.src.rpm: remote: too swift to rebuild
2022-Jan-21 14:11:29 :: [riscv64] #7600 gem-rack-2.2.2-alt0.1.re.rv64.src.rpm: build swiftly SKIPPED
2022-Jan-21 14:11:29 :: [riscv64] #7700 gem-rack-test-1.1.0.1-alt0.1.re.rv64.src.rpm: build start
2022-Jan-21 14:11:29 :: [riscv64] gem-rack-test-1.1.0.1-alt0.1.re.rv64.src.rpm: remote: too swift to rebuild
2022-Jan-21 14:11:29 :: [riscv64] #7700 gem-rack-test-1.1.0.1-alt0.1.re.rv64.src.rpm: build swiftly SKIPPED
2022-Jan-21 14:11:29 :: [riscv64] #10000 gem-radius-0.8.0-alt0.0.1.re.rv64.src.rpm: build start
2022-Jan-21 14:11:29 :: [riscv64] gem-radius-0.8.0-alt0.0.1.re.rv64.src.rpm: remote: too swift to rebuild
2022-Jan-21 14:11:29 :: [riscv64] #10000 gem-radius-0.8.0-alt0.0.1.re.rv64.src.rpm: build swiftly SKIPPED
2022-Jan-21 14:11:29 :: [riscv64] #10200 gem-rails-dom-testing-2.0.3-alt0.2.re.rv64.src.rpm: build start
2022-Jan-21 14:11:29 :: [riscv64] gem-rails-dom-testing-2.0.3-alt0.2.re.rv64.src.rpm: remote: too swift to rebuild
2022-Jan-21 14:11:29 :: [riscv64] #10200 gem-rails-dom-testing-2.0.3-alt0.2.re.rv64.src.rpm: build swiftly SKIPPED
2022-Jan-21 14:11:29 :: [riscv64] #10300 gem-rails-html-sanitizer-1.3.0-alt0.1.re.rv64.src.rpm: build start
2022-Jan-21 14:11:30 :: [riscv64] gem-rails-html-sanitizer-1.3.0-alt0.1.re.rv64.src.rpm: remote: too swift to rebuild
2022-Jan-21 14:11:30 :: [riscv64] #10300 gem-rails-html-sanitizer-1.3.0-alt0.1.re.rv64.src.rpm: build swiftly SKIPPED
2022-Jan-21 14:11:30 :: [riscv64] #10400 gem-rainbow-3.1.0-alt0.1.re.rv64.src.rpm: build start
2022-Jan-21 14:11:30 :: [riscv64] gem-rainbow-3.1.0-alt0.1.re.rv64.src.rpm: remote: too swift to rebuild
2022-Jan-21 14:11:30 :: [riscv64] #10400 gem-rainbow-3.1.0-alt0.1.re.rv64.src.rpm: build swiftly SKIPPED
2022-Jan-21 14:11:30 :: [riscv64] #10500 gem-rbench-0.2.4-alt0.1.re.rv64.src.rpm: build start
2022-Jan-21 14:11:30 :: [riscv64] gem-rbench-0.2.4-alt0.1.re.rv64.src.rpm: remote: too swift to rebuild
2022-Jan-21 14:11:30 :: [riscv64] #10500 gem-rbench-0.2.4-alt0.1.re.rv64.src.rpm: build swiftly SKIPPED
2022-Jan-21 14:11:30 :: [riscv64] #10600 gem-rb-fsevent-0.11.0-alt0.1.re.rv64.src.rpm: build start
2022-Jan-21 14:11:30 :: [riscv64] gem-rb-fsevent-0.11.0-alt0.1.re.rv64.src.rpm: remote: too swift to rebuild
2022-Jan-21 14:11:30 :: [riscv64] #10600 gem-rb-fsevent-0.11.0-alt0.1.re.rv64.src.rpm: build swiftly SKIPPED
2022-Jan-21 14:11:30 :: [riscv64] #10700 gem-rb-inotify-0.10.1-alt0.1.re.rv64.src.rpm: build start
2022-Jan-21 14:11:30 :: [riscv64] gem-rb-inotify-0.10.1-alt0.1.re.rv64.src.rpm: remote: too swift to rebuild
2022-Jan-21 14:11:30 :: [riscv64] #10700 gem-rb-inotify-0.10.1-alt0.1.re.rv64.src.rpm: build swiftly SKIPPED
2022-Jan-21 14:11:30 :: [riscv64] #11000 gem-redcloth-4.3.2-alt0.3.re.rv64.src.rpm: build start
2022-Jan-21 14:11:30 :: [riscv64] gem-redcloth-4.3.2-alt0.3.re.rv64.src.rpm: remote: too swift to rebuild
2022-Jan-21 14:11:30 :: [riscv64] #11000 gem-redcloth-4.3.2-alt0.3.re.rv64.src.rpm: build swiftly SKIPPED
2022-Jan-21 14:11:30 :: [riscv64] #11100 gem-regexp-parser-1.8.2-alt0.1.re.rv64.src.rpm: build start
2022-Jan-21 14:11:30 :: [riscv64] gem-regexp-parser-1.8.2-alt0.1.re.rv64.src.rpm: remote: too swift to rebuild
2022-Jan-21 14:11:30 :: [riscv64] #11100 gem-regexp-parser-1.8.2-alt0.1.re.rv64.src.rpm: build swiftly SKIPPED
2022-Jan-21 14:11:30 :: [riscv64] #11200 gem-rexml-3.2.5-alt0.1.re.rv64.src.rpm: build start
2022-Jan-21 14:11:31 :: [riscv64] gem-rexml-3.2.5-alt0.1.re.rv64.src.rpm: remote: too swift to rebuild
2022-Jan-21 14:11:31 :: [riscv64] #11200 gem-rexml-3.2.5-alt0.1.re.rv64.src.rpm: build swiftly SKIPPED
2022-Jan-21 14:11:31 :: [riscv64] #11300 gem-rouge-3.26.0-alt0.1.re.rv64.src.rpm: build start
2022-Jan-21 14:11:31 :: [riscv64] gem-rouge-3.26.0-alt0.1.re.rv64.src.rpm: remote: too swift to rebuild
2022-Jan-21 14:11:31 :: [riscv64] #11300 gem-rouge-3.26.0-alt0.1.re.rv64.src.rpm: build swiftly SKIPPED
2022-Jan-21 14:11:31 :: [riscv64] #11400 gem-rr-3.0.4-alt0.1.re.rv64.src.rpm: build start
2022-Jan-21 14:11:31 :: [riscv64] gem-rr-3.0.4-alt0.1.re.rv64.src.rpm: remote: too swift to rebuild
2022-Jan-21 14:11:31 :: [riscv64] #11400 gem-rr-3.0.4-alt0.1.re.rv64.src.rpm: build swiftly SKIPPED
2022-Jan-21 14:11:31 :: [riscv64] #11500 gem-rubocop-1.15.0-alt0.1.re.rv64.src.rpm: build start
2022-Jan-21 14:11:31 :: [riscv64] gem-rubocop-1.15.0-alt0.1.re.rv64.src.rpm: remote: too swift to rebuild
2022-Jan-21 14:11:31 :: [riscv64] #11500 gem-rubocop-1.15.0-alt0.1.re.rv64.src.rpm: build swiftly SKIPPED
2022-Jan-21 14:11:31 :: [riscv64] #11600 gem-rubocop-ast-1.7.0-alt0.1.re.rv64.src.rpm: build start
2022-Jan-21 14:11:32 :: [riscv64] gem-rubocop-ast-1.7.0-alt0.1.re.rv64.src.rpm: remote: too swift to rebuild
2022-Jan-21 14:11:32 :: [riscv64] #11600 gem-rubocop-ast-1.7.0-alt0.1.re.rv64.src.rpm: build swiftly SKIPPED
2022-Jan-21 14:11:32 :: [riscv64] #11700 gem-rubocop-discourse-2.4.2-alt0.1.re.rv64.src.rpm: build start
2022-Jan-21 14:11:32 :: [riscv64] gem-rubocop-discourse-2.4.2-alt0.1.re.rv64.src.rpm: remote: too swift to rebuild
2022-Jan-21 14:11:32 :: [riscv64] #11700 gem-rubocop-discourse-2.4.2-alt0.1.re.rv64.src.rpm: build swiftly SKIPPED
2022-Jan-21 14:11:32 :: [riscv64] #12000 gem-rubocop-performance-1.11.3-alt0.1.re.rv64.src.rpm: build start
2022-Jan-21 14:11:32 :: [riscv64] gem-rubocop-performance-1.11.3-alt0.1.re.rv64.src.rpm: remote: too swift to rebuild
2022-Jan-21 14:11:32 :: [riscv64] #12000 gem-rubocop-performance-1.11.3-alt0.1.re.rv64.src.rpm: build swiftly SKIPPED
2022-Jan-21 14:11:32 :: [riscv64] #12100 gem-rubocop-rspec-2.4.0-alt0.1.re.rv64.src.rpm: build start
2022-Jan-21 14:11:32 :: [riscv64] gem-rubocop-rspec-2.4.0-alt0.1.re.rv64.src.rpm: remote: too swift to rebuild
2022-Jan-21 14:11:32 :: [riscv64] #12100 gem-rubocop-rspec-2.4.0-alt0.1.re.rv64.src.rpm: build swiftly SKIPPED
2022-Jan-21 14:11:32 :: [riscv64] #12200 gem-ruby2-keywords-0.0.4-alt0.1.re.rv64.src.rpm: build start
2022-Jan-21 14:11:32 :: [riscv64] gem-ruby2-keywords-0.0.4-alt0.1.re.rv64.src.rpm: remote: too swift to rebuild
2022-Jan-21 14:11:32 :: [riscv64] #12200 gem-ruby2-keywords-0.0.4-alt0.1.re.rv64.src.rpm: build swiftly SKIPPED
2022-Jan-21 14:11:32 :: [riscv64] #12400 gem-sass-3.7.4-alt0.2.1.re.rv64.src.rpm: build start
2022-Jan-21 14:11:32 :: [riscv64] gem-sass-3.7.4-alt0.2.1.re.rv64.src.rpm: remote: too swift to rebuild
2022-Jan-21 14:11:32 :: [riscv64] #12400 gem-sass-3.7.4-alt0.2.1.re.rv64.src.rpm: build swiftly SKIPPED
2022-Jan-21 14:11:32 :: [riscv64] #12500 gem-sass-listen-4.0.0-alt0.3.re.rv64.src.rpm: build start
2022-Jan-21 14:11:33 :: [riscv64] gem-sass-listen-4.0.0-alt0.3.re.rv64.src.rpm: remote: too swift to rebuild
2022-Jan-21 14:11:33 :: [riscv64] #12500 gem-sass-listen-4.0.0-alt0.3.re.rv64.src.rpm: build swiftly SKIPPED
2022-Jan-21 14:11:33 :: [riscv64] #12600 gem-simplecov-0.21.2-alt0.1.re.rv64.src.rpm: build start
2022-Jan-21 14:11:33 :: [riscv64] gem-simplecov-0.21.2-alt0.1.re.rv64.src.rpm: remote: too swift to rebuild
2022-Jan-21 14:11:33 :: [riscv64] #12600 gem-simplecov-0.21.2-alt0.1.re.rv64.src.rpm: build swiftly SKIPPED
2022-Jan-21 14:11:33 :: [riscv64] #12700 gem-simplecov-html-0.12.3-alt0.1.re.rv64.src.rpm: build start
2022-Jan-21 14:11:33 :: [riscv64] gem-simplecov-html-0.12.3-alt0.1.re.rv64.src.rpm: remote: too swift to rebuild
2022-Jan-21 14:11:33 :: [riscv64] #12700 gem-simplecov-html-0.12.3-alt0.1.re.rv64.src.rpm: build swiftly SKIPPED
2022-Jan-21 14:11:33 :: [riscv64] #13000 gem-simplecov-json-formatter-0.1.2-alt0.1.re.rv64.src.rpm: build start
2022-Jan-21 14:11:33 :: [riscv64] gem-simplecov-json-formatter-0.1.2-alt0.1.re.rv64.src.rpm: remote: too swift to rebuild
2022-Jan-21 14:11:33 :: [riscv64] #13000 gem-simplecov-json-formatter-0.1.2-alt0.1.re.rv64.src.rpm: build swiftly SKIPPED
2022-Jan-21 14:11:33 :: [riscv64] #13100 gem-sinatra-2.1.0-alt0.1.re.rv64.src.rpm: build start
2022-Jan-21 14:11:33 :: [riscv64] gem-sinatra-2.1.0-alt0.1.re.rv64.src.rpm: remote: too swift to rebuild
2022-Jan-21 14:11:33 :: [riscv64] #13100 gem-sinatra-2.1.0-alt0.1.re.rv64.src.rpm: build swiftly SKIPPED
2022-Jan-21 14:11:33 :: [riscv64] #13200 gem-slim-4.1.0-alt0.1.re.rv64.src.rpm: build start
2022-Jan-21 14:11:33 :: [riscv64] gem-slim-4.1.0-alt0.1.re.rv64.src.rpm: remote: too swift to rebuild
2022-Jan-21 14:11:33 :: [riscv64] #13200 gem-slim-4.1.0-alt0.1.re.rv64.src.rpm: build swiftly SKIPPED
2022-Jan-21 14:11:34 :: [riscv64] #13300 gem-sprockets-4.0.2.1-alt0.1.re.rv64.src.rpm: build start
2022-Jan-21 14:11:34 :: [riscv64] gem-sprockets-4.0.2.1-alt0.1.re.rv64.src.rpm: remote: too swift to rebuild
2022-Jan-21 14:11:34 :: [riscv64] #13300 gem-sprockets-4.0.2.1-alt0.1.re.rv64.src.rpm: build swiftly SKIPPED
2022-Jan-21 14:11:34 :: [riscv64] #13400 gem-sprockets-rails-3.2.2-alt0.1.re.rv64.src.rpm: build start
2022-Jan-21 14:11:34 :: [riscv64] gem-sprockets-rails-3.2.2-alt0.1.re.rv64.src.rpm: remote: too swift to rebuild
2022-Jan-21 14:11:34 :: [riscv64] #13400 gem-sprockets-rails-3.2.2-alt0.1.re.rv64.src.rpm: build swiftly SKIPPED
2022-Jan-21 14:11:34 :: [riscv64] #13500 gem-stringex-2.8.5-alt0.1.re.rv64.src.rpm: build start
2022-Jan-21 14:11:34 :: [riscv64] gem-stringex-2.8.5-alt0.1.re.rv64.src.rpm: remote: too swift to rebuild
2022-Jan-21 14:11:34 :: [riscv64] #13500 gem-stringex-2.8.5-alt0.1.re.rv64.src.rpm: build swiftly SKIPPED
2022-Jan-21 14:11:34 :: [riscv64] #13600 gem-temple-0.8.2-alt0.1.re.rv64.src.rpm: build start
2022-Jan-21 14:11:34 :: [riscv64] gem-temple-0.8.2-alt0.1.re.rv64.src.rpm: remote: too swift to rebuild
2022-Jan-21 14:11:34 :: [riscv64] #13600 gem-temple-0.8.2-alt0.1.re.rv64.src.rpm: build swiftly SKIPPED
2022-Jan-21 14:11:34 :: [riscv64] #13700 gem-test-unit-3.3.5-alt0.1.re.rv64.src.rpm: build start
2022-Jan-21 14:11:34 :: [riscv64] gem-test-unit-3.3.5-alt0.1.re.rv64.src.rpm: remote: too swift to rebuild
2022-Jan-21 14:11:34 :: [riscv64] #13700 gem-test-unit-3.3.5-alt0.1.re.rv64.src.rpm: build swiftly SKIPPED
2022-Jan-21 14:11:34 :: [riscv64] #14000 gem-text-1.3.1-alt0.5.re.rv64.src.rpm: build start
2022-Jan-21 14:11:35 :: [riscv64] gem-text-1.3.1-alt0.5.re.rv64.src.rpm: remote: too swift to rebuild
2022-Jan-21 14:11:35 :: [riscv64] #14000 gem-text-1.3.1-alt0.5.re.rv64.src.rpm: build swiftly SKIPPED
2022-Jan-21 14:11:35 :: [riscv64] #14200 gem-tilt-2.0.10.1-alt0.1.re.rv64.src.rpm: build start
2022-Jan-21 14:11:35 :: [riscv64] gem-tilt-2.0.10.1-alt0.1.re.rv64.src.rpm: remote: too swift to rebuild
2022-Jan-21 14:11:35 :: [riscv64] #14200 gem-tilt-2.0.10.1-alt0.1.re.rv64.src.rpm: build swiftly SKIPPED
2022-Jan-21 14:11:35 :: [riscv64] #14300 gem-twitter-text-3.1.0-alt0.1.re.rv64.src.rpm: build start
2022-Jan-21 14:11:35 :: [riscv64] gem-twitter-text-3.1.0-alt0.1.re.rv64.src.rpm: remote: too swift to rebuild
2022-Jan-21 14:11:35 :: [riscv64] #14300 gem-twitter-text-3.1.0-alt0.1.re.rv64.src.rpm: build swiftly SKIPPED
2022-Jan-21 14:11:35 :: [riscv64] #14400 gem-tzinfo-2.0.4-alt0.1.re.rv64.src.rpm: build start
2022-Jan-21 14:11:35 :: [riscv64] gem-tzinfo-2.0.4-alt0.1.re.rv64.src.rpm: remote: too swift to rebuild
2022-Jan-21 14:11:35 :: [riscv64] #14400 gem-tzinfo-2.0.4-alt0.1.re.rv64.src.rpm: build swiftly SKIPPED
2022-Jan-21 14:11:35 :: [riscv64] #14500 gem-unf-0.2.0-alt0.0.1.re.rv64.src.rpm: build start
2022-Jan-21 14:11:35 :: [riscv64] gem-unf-0.2.0-alt0.0.1.re.rv64.src.rpm: remote: too swift to rebuild
2022-Jan-21 14:11:35 :: [riscv64] #14500 gem-unf-0.2.0-alt0.0.1.re.rv64.src.rpm: build swiftly SKIPPED
2022-Jan-21 14:11:35 :: [riscv64] #14600 gem-unicode-display-width-2.0.0-alt0.1.re.rv64.src.rpm: build start
2022-Jan-21 14:11:35 :: [riscv64] gem-unicode-display-width-2.0.0-alt0.1.re.rv64.src.rpm: remote: too swift to rebuild
2022-Jan-21 14:11:35 :: [riscv64] #14600 gem-unicode-display-width-2.0.0-alt0.1.re.rv64.src.rpm: build swiftly SKIPPED
2022-Jan-21 14:11:35 :: [riscv64] #14700 gem-websocket-extensions-0.1.5-alt0.1.re.rv64.src.rpm: build start
2022-Jan-21 14:11:35 :: [riscv64] gem-websocket-extensions-0.1.5-alt0.1.re.rv64.src.rpm: remote: too swift to rebuild
2022-Jan-21 14:11:35 :: [riscv64] #14700 gem-websocket-extensions-0.1.5-alt0.1.re.rv64.src.rpm: build swiftly SKIPPED
2022-Jan-21 14:11:35 :: [riscv64] #15000 gem-wikicloth-0.8.3.1-alt0.1.re.rv64.src.rpm: build start
2022-Jan-21 14:11:36 :: [riscv64] gem-wikicloth-0.8.3.1-alt0.1.re.rv64.src.rpm: remote: too swift to rebuild
2022-Jan-21 14:11:36 :: [riscv64] #15000 gem-wikicloth-0.8.3.1-alt0.1.re.rv64.src.rpm: build swiftly SKIPPED
2022-Jan-21 14:11:36 :: [riscv64] #15100 gem-yard-0.9.25-alt0.1.re.rv64.src.rpm: build start
2022-Jan-21 14:11:36 :: [riscv64] gem-yard-0.9.25-alt0.1.re.rv64.src.rpm: remote: too swift to rebuild
2022-Jan-21 14:11:36 :: [riscv64] #15100 gem-yard-0.9.25-alt0.1.re.rv64.src.rpm: build swiftly SKIPPED
2022-Jan-21 14:11:36 :: [riscv64] #15200 gem-zeitwerk-2.4.2-alt0.1.re.rv64.src.rpm: build start
2022-Jan-21 14:11:36 :: [riscv64] gem-zeitwerk-2.4.2-alt0.1.re.rv64.src.rpm: remote: too swift to rebuild
2022-Jan-21 14:11:36 :: [riscv64] #15200 gem-zeitwerk-2.4.2-alt0.1.re.rv64.src.rpm: build swiftly SKIPPED
2022-Jan-21 14:11:36 :: [riscv64] #15300 ruby-timecop-0.9.1-alt0.1.re.rv64.src.rpm: build start
2022-Jan-21 14:11:36 :: [riscv64] ruby-timecop-0.9.1-alt0.1.re.rv64.src.rpm: remote: too swift to rebuild
2022-Jan-21 14:11:36 :: [riscv64] #15300 ruby-timecop-0.9.1-alt0.1.re.rv64.src.rpm: build swiftly SKIPPED
2022-Jan-21 14:11:36 :: [riscv64] #20400 gem-rdoc-6.3.0-alt1.src.rpm: build start
2022-Jan-21 14:11:36 :: [riscv64] gem-rdoc-6.3.0-alt1.src.rpm: remote: too swift to rebuild
2022-Jan-21 14:11:36 :: [riscv64] #20400 gem-rdoc-6.3.0-alt1.src.rpm: build swiftly SKIPPED
2022-Jan-21 14:11:36 :: [riscv64] #20500 gem-thor-1.0.1-alt1.src.rpm: build start
2022-Jan-21 14:11:37 :: [riscv64] gem-thor-1.0.1-alt1.src.rpm: remote: too swift to rebuild
2022-Jan-21 14:11:37 :: [riscv64] #20500 gem-thor-1.0.1-alt1.src.rpm: build swiftly SKIPPED
2022-Jan-21 14:11:37 :: [riscv64] #21000 libcaca-0.99-alt22.src.rpm: build start
2022-Jan-21 14:11:37 :: [riscv64] libcaca-0.99-alt22.src.rpm: remote: too swift to rebuild
2022-Jan-21 14:11:37 :: [riscv64] #21000 libcaca-0.99-alt22.src.rpm: build swiftly SKIPPED
2022-Jan-21 14:11:37 :: [riscv64] #21100 xapian-bindings-1.4.15-alt3.src.rpm: build start
2022-Jan-21 14:11:37 :: [riscv64] xapian-bindings-1.4.15-alt3.src.rpm: remote: too swift to rebuild
2022-Jan-21 14:11:37 :: [riscv64] #21100 xapian-bindings-1.4.15-alt3.src.rpm: build swiftly SKIPPED
2022-Jan-21 14:11:37 :: [riscv64] #21600 gem-nio4r-2.5.2-alt1.src.rpm: build start
2022-Jan-21 14:11:38 :: [riscv64] gem-nio4r-2.5.2-alt1.src.rpm: remote: too swift to rebuild
2022-Jan-21 14:11:38 :: [riscv64] #21600 gem-nio4r-2.5.2-alt1.src.rpm: build swiftly SKIPPED
2022-Jan-21 14:11:38 :: [riscv64] #21700 gem-redcarpet-3.5.0-alt1.src.rpm: build start
2022-Jan-21 14:11:38 :: [riscv64] gem-redcarpet-3.5.0-alt1.src.rpm: remote: too swift to rebuild
2022-Jan-21 14:11:38 :: [riscv64] #21700 gem-redcarpet-3.5.0-alt1.src.rpm: build swiftly SKIPPED
2022-Jan-21 14:11:38 :: [riscv64] #22000 gem-rake-compiler-dock-1.1.0-alt1.src.rpm: build start
2022-Jan-21 14:11:38 :: [riscv64] gem-rake-compiler-dock-1.1.0-alt1.src.rpm: remote: too swift to rebuild
2022-Jan-21 14:11:38 :: [riscv64] #22000 gem-rake-compiler-dock-1.1.0-alt1.src.rpm: build swiftly SKIPPED
2022-Jan-21 14:11:38 :: [riscv64] #22100 gem-json-2.5.1-alt1.src.rpm: build start
2022-Jan-21 14:11:38 :: [riscv64] gem-json-2.5.1-alt1.src.rpm: remote: too swift to rebuild
2022-Jan-21 14:11:38 :: [riscv64] #22100 gem-json-2.5.1-alt1.src.rpm: build swiftly SKIPPED
2022-Jan-21 14:11:38 :: [riscv64] #22200 gem-concurrent-ruby-1.1.7-alt2.src.rpm: build start
2022-Jan-21 14:11:39 :: [riscv64] gem-concurrent-ruby-1.1.7-alt2.src.rpm: remote: too swift to rebuild
2022-Jan-21 14:11:39 :: [riscv64] #22200 gem-concurrent-ruby-1.1.7-alt2.src.rpm: build swiftly SKIPPED
2022-Jan-21 14:11:39 :: [riscv64] #22300 gem-hoe-markdown-1.4.0-alt1.src.rpm: build start
2022-Jan-21 14:11:39 :: [riscv64] gem-hoe-markdown-1.4.0-alt1.src.rpm: remote: too swift to rebuild
2022-Jan-21 14:11:39 :: [riscv64] #22300 gem-hoe-markdown-1.4.0-alt1.src.rpm: build swiftly SKIPPED
2022-Jan-21 14:11:39 :: [riscv64] #22400 gem-oj-3.10.5-alt1.1.src.rpm: build start
2022-Jan-21 14:11:39 :: [riscv64] gem-oj-3.10.5-alt1.1.src.rpm: remote: too swift to rebuild
2022-Jan-21 14:11:39 :: [riscv64] #22400 gem-oj-3.10.5-alt1.1.src.rpm: build swiftly SKIPPED
2022-Jan-21 14:11:39 :: [riscv64] #22500 gem-idn-ruby-0.1.0-alt2.1.src.rpm: build start
2022-Jan-21 14:11:39 :: [riscv64] gem-idn-ruby-0.1.0-alt2.1.src.rpm: remote: too swift to rebuild
2022-Jan-21 14:11:39 :: [riscv64] #22500 gem-idn-ruby-0.1.0-alt2.1.src.rpm: build swiftly SKIPPED
2022-Jan-21 14:11:39 :: [riscv64] #22600 gem-rake-compiler-1.1.2-alt1.src.rpm: build start
2022-Jan-21 14:11:39 :: [riscv64] gem-rake-compiler-1.1.2-alt1.src.rpm: remote: too swift to rebuild
2022-Jan-21 14:11:39 :: [riscv64] #22600 gem-rake-compiler-1.1.2-alt1.src.rpm: build swiftly SKIPPED
2022-Jan-21 14:11:39 :: [riscv64] #23000 gem-ffi-1.15.4-alt1.src.rpm: build start
2022-Jan-21 14:11:39 :: [riscv64] gem-ffi-1.15.4-alt1.src.rpm: remote: too swift to rebuild
2022-Jan-21 14:11:39 :: [riscv64] #23000 gem-ffi-1.15.4-alt1.src.rpm: build swiftly SKIPPED
2022-Jan-21 14:11:39 :: [riscv64] #23100 gem-yajl-ruby-1.4.1-alt3.src.rpm: build start
2022-Jan-21 14:11:40 :: [riscv64] gem-yajl-ruby-1.4.1-alt3.src.rpm: remote: too swift to rebuild
2022-Jan-21 14:11:40 :: [riscv64] #23100 gem-yajl-ruby-1.4.1-alt3.src.rpm: build swiftly SKIPPED
2022-Jan-21 14:11:40 :: [riscv64] #23200 gem-eventmachine-1.3.0.dev.1-alt1.src.rpm: build start
2022-Jan-21 14:11:40 :: [riscv64] gem-eventmachine-1.3.0.dev.1-alt1.src.rpm: remote: too swift to rebuild
2022-Jan-21 14:11:40 :: [riscv64] #23200 gem-eventmachine-1.3.0.dev.1-alt1.src.rpm: build swiftly SKIPPED
2022-Jan-21 14:11:40 :: [riscv64] #23300 gem-websocket-driver-0.7.5-alt1.src.rpm: build start
2022-Jan-21 14:11:40 :: [riscv64] gem-websocket-driver-0.7.5-alt1.src.rpm: remote: too swift to rebuild
2022-Jan-21 14:11:40 :: [riscv64] #23300 gem-websocket-driver-0.7.5-alt1.src.rpm: build swiftly SKIPPED
2022-Jan-21 14:11:40 :: [riscv64] #23500 gem-gem-hadar-1.11.0-alt1.src.rpm: build start
2022-Jan-21 14:11:40 :: [riscv64] gem-gem-hadar-1.11.0-alt1.src.rpm: remote: too swift to rebuild
2022-Jan-21 14:11:40 :: [riscv64] #23500 gem-gem-hadar-1.11.0-alt1.src.rpm: build swiftly SKIPPED
2022-Jan-21 14:11:40 :: [riscv64] #23600 gem-term-ansicolor-1.7.1-alt1.1.src.rpm: build start
2022-Jan-21 14:11:40 :: [riscv64] gem-term-ansicolor-1.7.1-alt1.1.src.rpm: remote: too swift to rebuild
2022-Jan-21 14:11:40 :: [riscv64] #23600 gem-term-ansicolor-1.7.1-alt1.1.src.rpm: build swiftly SKIPPED
2022-Jan-21 14:11:40 :: [riscv64] #23700 gem-xmlrpc-0.3.2-alt1.src.rpm: build start
2022-Jan-21 14:11:41 :: [riscv64] gem-xmlrpc-0.3.2-alt1.src.rpm: remote: too swift to rebuild
2022-Jan-21 14:11:41 :: [riscv64] #23700 gem-xmlrpc-0.3.2-alt1.src.rpm: build swiftly SKIPPED
2022-Jan-21 14:11:41 :: [riscv64] #24000 gem-webrick-1.7.0-alt1.src.rpm: build start
2022-Jan-21 14:11:41 :: [riscv64] gem-webrick-1.7.0-alt1.src.rpm: remote: too swift to rebuild
2022-Jan-21 14:11:41 :: [riscv64] #24000 gem-webrick-1.7.0-alt1.src.rpm: build swiftly SKIPPED
2022-Jan-21 14:11:41 :: [riscv64] #24100 gem-mspec-1.8.0-alt1.src.rpm: build start
2022-Jan-21 14:11:41 :: [riscv64] gem-mspec-1.8.0-alt1.src.rpm: remote: too swift to rebuild
2022-Jan-21 14:11:41 :: [riscv64] #24100 gem-mspec-1.8.0-alt1.src.rpm: build swiftly SKIPPED
2022-Jan-21 14:11:41 :: [riscv64] #24200 gem-net-telnet-0.2.0.1-alt0.1.src.rpm: build start
2022-Jan-21 14:11:41 :: [riscv64] gem-net-telnet-0.2.0.1-alt0.1.src.rpm: remote: too swift to rebuild
2022-Jan-21 14:11:41 :: [riscv64] #24200 gem-net-telnet-0.2.0.1-alt0.1.src.rpm: build swiftly SKIPPED
2022-Jan-21 14:11:41 :: [riscv64] #24400 gem-hpricot-0.8.6-alt4.3.src.rpm: build start
2022-Jan-21 14:11:41 :: [riscv64] gem-hpricot-0.8.6-alt4.3.src.rpm: remote: too swift to rebuild
2022-Jan-21 14:11:41 :: [riscv64] #24400 gem-hpricot-0.8.6-alt4.3.src.rpm: build swiftly SKIPPED
2022-Jan-21 14:11:41 :: [riscv64] #24500 gem-sync-0.5.0-alt1.src.rpm: build start
2022-Jan-21 14:11:41 :: [riscv64] gem-sync-0.5.0-alt1.src.rpm: remote: too swift to rebuild
2022-Jan-21 14:11:41 :: [riscv64] #24500 gem-sync-0.5.0-alt1.src.rpm: build swiftly SKIPPED
2022-Jan-21 14:11:41 :: [riscv64] #24600 gem-tins-1.29.0-alt1.src.rpm: build start
2022-Jan-21 14:11:42 :: [riscv64] gem-tins-1.29.0-alt1.src.rpm: remote: too swift to rebuild
2022-Jan-21 14:11:42 :: [riscv64] #24600 gem-tins-1.29.0-alt1.src.rpm: build swiftly SKIPPED
2022-Jan-21 14:11:42 :: [riscv64] #24700 gem-progressbar-1.10.1-alt1.1.src.rpm: build start
2022-Jan-21 14:11:42 :: [riscv64] gem-progressbar-1.10.1-alt1.1.src.rpm: remote: too swift to rebuild
2022-Jan-21 14:11:42 :: [riscv64] #24700 gem-progressbar-1.10.1-alt1.1.src.rpm: build swiftly SKIPPED
2022-Jan-21 14:11:42 :: [riscv64] #25000 gem-ruby-ldap-0.9.20-alt4.2.src.rpm: build start
2022-Jan-21 14:11:42 :: [riscv64] gem-ruby-ldap-0.9.20-alt4.2.src.rpm: remote: too swift to rebuild
2022-Jan-21 14:11:42 :: [riscv64] #25000 gem-ruby-ldap-0.9.20-alt4.2.src.rpm: build swiftly SKIPPED
2022-Jan-21 14:11:42 :: [riscv64] #25200 gem-activesupport-6.1.4.1-alt0.2.re.rv64.src.rpm: build start
2022-Jan-21 14:11:42 :: [riscv64] gem-activesupport-6.1.4.1-alt0.2.re.rv64.src.rpm: remote: too swift to rebuild
2022-Jan-21 14:11:42 :: [riscv64] #25200 gem-activesupport-6.1.4.1-alt0.2.re.rv64.src.rpm: build swiftly SKIPPED
2022-Jan-21 14:11:42 :: [riscv64] #25500 gem-rubygems-update-3.2.19-alt1.src.rpm: build start
2022-Jan-21 14:24:04 :: [riscv64] #25500 gem-rubygems-update-3.2.19-alt1.src.rpm: build OK
2022-Jan-21 14:24:04 :: [riscv64] #25600 gem-nokogiri-1.12.5-alt1.src.rpm: build start
<13>Jan 21 14:24:54 rpmi: libruby-2.7.5-alt1 sisyphus_riscv64+15535.100.2.1 1642670470 installed
<13>Jan 21 14:24:54 rpmi: libgdbm-1.8.3-alt10 sisyphus_riscv64+8290.100.1.1 1632325631 installed
<13>Jan 21 14:24:54 rpmi: libyaml2-0.2.5-alt1 sisyphus_riscv64+6205.2500.8.1 1631347614 installed
<13>Jan 21 14:24:54 rpmi: libyaml-devel-0.2.5-alt1 sisyphus_riscv64+6205.2500.8.1 1631347614 installed
<13>Jan 21 14:24:54 rpmi: libgdbm-devel-1.8.3-alt10 sisyphus_riscv64+8290.100.1.1 1632325631 installed
<13>Jan 21 14:24:54 rpmi: rpm-macros-ruby-1:1.0.0-alt16 sisyphus_riscv64+11375.100.1.1 1635835542 installed
<13>Jan 21 14:24:54 rpmi: zlib-devel-1.2.11-alt2 sisyphus_riscv64+8330.100.1.1 1632744253 installed
<13>Jan 21 14:24:54 rpmi: libreadline-devel-7.0.3-alt4 sisyphus_riscv64+8417.100.1.1 1633094554 installed
<13>Jan 21 14:24:55 rpmi: groff-base-1.22.3-alt2 sisyphus_riscv64+9424.100.1.1 1634389146 installed
<13>Jan 21 14:24:55 rpmi: libncurses-6.3.20211106-alt1 sisyphus_riscv64+12595.100.1.1 1636531498 installed
<13>Jan 21 14:24:55 rpmi: libtinfo-devel-6.3.20211106-alt1 sisyphus_riscv64+12595.100.1.1 1636531498 installed
<13>Jan 21 14:24:55 rpmi: libncurses-devel-6.3.20211106-alt1 sisyphus_riscv64+12595.100.1.1 1636531498 installed
<13>Jan 21 14:24:55 rpmi: libncursesw-devel-6.3.20211106-alt1 sisyphus_riscv64+12595.100.1.1 1636531498 installed
<13>Jan 21 14:24:55 rpmi: libffi-devel-1:3.4.2-alt2 sisyphus_riscv64+9653.100.1.1 1634764132 installed
<13>Jan 21 14:24:55 rpmi: libdb4.7-devel-4.7.25-alt12 sisyphus_riscv64.6206.100 1630261417 installed
<13>Jan 21 14:24:56 rpmi: doxygen-1:1.9.1-alt1 sisyphus_riscv64+8602.100.1.1 1633520464 installed
<13>Jan 21 14:24:56 rpmi: chrpath-0.16-alt1 sisyphus_riscv64+12238.100.1.1 1636271704 installed
<13>Jan 21 14:24:56 rpmi: libp11-kit-0.24.1-alt1 sisyphus_riscv64+15481.100.1.1 1642606328 installed
<13>Jan 21 14:24:56 rpmi: libtasn1-4.17.0-alt2 sisyphus_riscv64+8488.100.1.1 1633297811 installed
<13>Jan 21 14:24:56 rpmi: rpm-macros-alternatives-0.5.1-alt1 sisyphus_riscv64+8931.100.1.1 1633759172 installed
<13>Jan 21 14:24:56 rpmi: alternatives-0.5.1-alt1 sisyphus_riscv64+8931.100.1.1 1633759172 installed
<13>Jan 21 14:24:56 rpmi: ca-certificates-2021.10.06-alt1 sisyphus_riscv64+8702.300.2.1 1633749125 installed
<13>Jan 21 14:24:56 rpmi: ca-trust-0.1.2-alt1 sisyphus_riscv64+8337.100.2.2 1632951598 installed
<13>Jan 21 14:24:56 rpmi: p11-kit-trust-0.24.1-alt1 sisyphus_riscv64+15481.100.1.1 1642606328 installed
<13>Jan 21 14:24:57 rpmi: libcrypto1.1-1.1.1l-alt2 sisyphus_riscv64+9559.100.1.1 1634435197 installed
<13>Jan 21 14:24:57 rpmi: libssl1.1-1.1.1l-alt2 sisyphus_riscv64+9559.100.1.1 1634435197 installed
<13>Jan 21 14:24:57 rpmi: gem-minitest-5.14.4-alt0.1.re.rv64 sisyphus_riscv64+15535.6100.4.1 1642678752 installed
<13>Jan 21 14:24:57 rpmi: ruby-net-telnet-0.2.0-alt1 sisyphus+219345.2700.8.1 1547631566 installed
<13>Jan 21 14:24:57 rpmi: gem-rake-13.0.5-alt1 sisyphus_riscv64+15535.300.3.1 1642672454 installed
<13>Jan 21 14:24:57 rpmi: ruby-xmlrpc-0.3.0-alt1 sisyphus+219345.3300.8.1 1547631818 installed
<13>Jan 21 14:24:57 rpmi: gem-2:3.1.6-alt1.2 sisyphus_riscv64+15535.100.2.1 1642670470 installed
<13>Jan 21 14:24:57 rpmi: ri-6.3.0-alt1 sisyphus_riscv64+15535.20400.6.1 1642686220 installed
<13>Jan 21 14:24:57 rpmi: gem-rdoc-6.3.0-alt1 sisyphus_riscv64+15535.20400.6.1 1642686220 installed
<13>Jan 21 14:24:57 rpmi: rdoc-6.3.0-alt1 sisyphus_riscv64+15535.20400.6.1 1642686220 installed
<13>Jan 21 14:24:57 rpmi: rake-13.0.5-alt1 sisyphus_riscv64+15535.300.3.1 1642672454 installed
<13>Jan 21 14:24:57 rpmi: erb-2.7.5-alt1 sisyphus_riscv64+15535.100.2.1 1642670470 installed
<13>Jan 21 14:24:57 rpmi: irb-2.7.5-alt1 sisyphus_riscv64+15535.100.2.1 1642670470 installed
<13>Jan 21 14:24:57 rpmi: gem-test-unit-3.3.5-alt0.1.re.rv64 sisyphus_riscv64+15535.13700.4.1 1642682860 installed
<13>Jan 21 14:24:57 rpmi: gem-power-assert-1.1.7-alt0.1.re.rv64 sisyphus_riscv64+15535.7300.4.1 1642679628 installed
<13>Jan 21 14:24:57 rpmi: bundle-2.2.19-alt1 sisyphus_riscv64+15535.25500.15.1 1642774706 installed
<13>Jan 21 14:25:06 rpmi: gem-bundler-2.2.19-alt1 sisyphus_riscv64+15535.25500.15.1 1642774706 installed
<13>Jan 21 14:25:06 rpmi: ruby-2.7.5-alt1 sisyphus_riscv64+15535.100.2.1 1642670470 installed
<13>Jan 21 14:25:07 rpmi: ruby-stdlibs-2.7.5-alt1 sisyphus_riscv64+15535.100.2.1 1642670470 installed
<13>Jan 21 14:25:07 rpmi: setup-rb-5.999.5-alt11 sisyphus_riscv64+15535.200.2.1 1642671562 installed
<13>Jan 21 14:25:07 rpmi: gem-setup-5.999.5-alt11 sisyphus_riscv64+15535.200.2.1 1642671562 installed
<13>Jan 21 14:25:07 rpmi: libssl-devel-1.1.1l-alt2 sisyphus_riscv64+9559.100.1.1 1634435197 installed
<13>Jan 21 14:25:07 rpmi: libruby-devel-2.7.5-alt1 sisyphus_riscv64+15535.100.2.1 1642670470 installed
<13>Jan 21 14:25:07 rpmi: rpm-build-ruby-1:1.0.0-alt16 sisyphus_riscv64+11375.100.1.1 1635835542 installed
Reading Package Lists...
Building Dependency Tree...
MI2a: mark libxslt-devel
MI2a:  target libxslt
MI2a:   mark libxslt
rpm-build-ruby is already the newest version.
zlib-devel is already the newest version.
Version ruby-stdlibs#2.7.5-alt1:sisyphus_riscv64+15535.100.2.1 at 1642670470 for gem(racc)>=1.4 is already installed
ruby-stdlibs is already the newest version.
Version ruby-stdlibs#2.7.5-alt1:sisyphus_riscv64+15535.100.2.1 at 1642670470 for gem(racc)<2 is already installed
ruby-stdlibs is already the newest version.
E: Version >='2.6.1' for 'gem(mini_portile2)' was not found
hsh-install: Failed to calculate package file list.
hsh-install: Failed to generate package file list.
2022-Jan-21 14:25:20 :: [riscv64] gem-nokogiri-1.12.5-alt1.src.rpm: remote: cannot build src.rpm
2022-Jan-21 14:25:20 :: [riscv64] #25600 gem-nokogiri-1.12.5-alt1.src.rpm: build FAILED
[riscv64] #25600 gem-nokogiri-1.12.5-alt1.src.rpm: KEEPS GOING
riscv64/srpm/ruby-2.7.5-alt1.src.rpm: license not found in '/usr/share/license' directory: BSD-2-Clause
riscv64/srpm/ruby-2.7.5-alt1.src.rpm: license not found in '/usr/share/license' directory: Ruby
riscv64/rpms/gem-3.1.6-alt1.2.noarch.rpm: license not found in '/usr/share/license' directory: BSD-2-Clause
riscv64/rpms/gem-3.1.6-alt1.2.noarch.rpm: license not found in '/usr/share/license' directory: Ruby
riscv64/rpms/ruby-stdlibs-debuginfo-2.7.5-alt1.riscv64.rpm: license not found in '/usr/share/license' directory: BSD-2-Clause
riscv64/rpms/ruby-stdlibs-debuginfo-2.7.5-alt1.riscv64.rpm: license not found in '/usr/share/license' directory: Ruby
riscv64/rpms/ruby-stdlibs-2.7.5-alt1.riscv64.rpm: license not found in '/usr/share/license' directory: BSD-2-Clause
riscv64/rpms/ruby-stdlibs-2.7.5-alt1.riscv64.rpm: license not found in '/usr/share/license' directory: Ruby
riscv64/rpms/ruby-mspec-2.7.5-alt1.riscv64.rpm: license not found in '/usr/share/license' directory: BSD-2-Clause
riscv64/rpms/ruby-mspec-2.7.5-alt1.riscv64.rpm: license not found in '/usr/share/license' directory: Ruby
riscv64/rpms/libruby-2.7.5-alt1.riscv64.rpm: license not found in '/usr/share/license' directory: BSD-2-Clause
riscv64/rpms/libruby-2.7.5-alt1.riscv64.rpm: license not found in '/usr/share/license' directory: Ruby
riscv64/rpms/ruby-doc-2.7.5-alt1.noarch.rpm: license not found in '/usr/share/license' directory: BSD-2-Clause
riscv64/rpms/ruby-doc-2.7.5-alt1.noarch.rpm: license not found in '/usr/share/license' directory: Ruby
riscv64/rpms/ruby-miniruby-src-2.7.5-alt1.noarch.rpm: license not found in '/usr/share/license' directory: BSD-2-Clause
riscv64/rpms/ruby-miniruby-src-2.7.5-alt1.noarch.rpm: license not found in '/usr/share/license' directory: Ruby
riscv64/rpms/libruby-devel-2.7.5-alt1.riscv64.rpm: license not found in '/usr/share/license' directory: BSD-2-Clause
riscv64/rpms/libruby-devel-2.7.5-alt1.riscv64.rpm: license not found in '/usr/share/license' directory: Ruby
riscv64/rpms/erb-2.7.5-alt1.noarch.rpm: license not found in '/usr/share/license' directory: BSD-2-Clause
riscv64/rpms/erb-2.7.5-alt1.noarch.rpm: license not found in '/usr/share/license' directory: Ruby
riscv64/rpms/ri-doc-2.7.5-alt1.noarch.rpm: license not found in '/usr/share/license' directory: BSD-2-Clause
riscv64/rpms/ri-doc-2.7.5-alt1.noarch.rpm: license not found in '/usr/share/license' directory: Ruby
riscv64/rpms/libruby-debuginfo-2.7.5-alt1.riscv64.rpm: license not found in '/usr/share/license' directory: BSD-2-Clause
riscv64/rpms/libruby-debuginfo-2.7.5-alt1.riscv64.rpm: license not found in '/usr/share/license' directory: Ruby
riscv64/rpms/irb-2.7.5-alt1.noarch.rpm: license not found in '/usr/share/license' directory: BSD-2-Clause
riscv64/rpms/irb-2.7.5-alt1.noarch.rpm: license not found in '/usr/share/license' directory: Ruby
riscv64/rpms/ruby-debuginfo-2.7.5-alt1.riscv64.rpm: license not found in '/usr/share/license' directory: BSD-2-Clause
riscv64/rpms/ruby-debuginfo-2.7.5-alt1.riscv64.rpm: license not found in '/usr/share/license' directory: Ruby
riscv64/rpms/libruby-devel-static-2.7.5-alt1.riscv64.rpm: license not found in '/usr/share/license' directory: BSD-2-Clause
riscv64/rpms/libruby-devel-static-2.7.5-alt1.riscv64.rpm: license not found in '/usr/share/license' directory: Ruby
riscv64/rpms/ruby-2.7.5-alt1.riscv64.rpm: license not found in '/usr/share/license' directory: BSD-2-Clause
riscv64/rpms/ruby-2.7.5-alt1.riscv64.rpm: license not found in '/usr/share/license' directory: Ruby
gem-3.1.6-alt1.2.noarch.rpm: changelog name (majioa@) does not match expected name (alt_sisyphus@)
ruby-stdlibs-debuginfo-2.7.5-alt1.riscv64.rpm: changelog name (majioa@) does not match expected name (alt_sisyphus@)
ruby-stdlibs-2.7.5-alt1.riscv64.rpm: changelog name (majioa@) does not match expected name (alt_sisyphus@)
ruby-mspec-2.7.5-alt1.riscv64.rpm: changelog name (majioa@) does not match expected name (alt_sisyphus@)
libruby-2.7.5-alt1.riscv64.rpm: changelog name (majioa@) does not match expected name (alt_sisyphus@)
ruby-doc-2.7.5-alt1.noarch.rpm: changelog name (majioa@) does not match expected name (alt_sisyphus@)
ruby-miniruby-src-2.7.5-alt1.noarch.rpm: changelog name (majioa@) does not match expected name (alt_sisyphus@)
libruby-devel-2.7.5-alt1.riscv64.rpm: changelog name (majioa@) does not match expected name (alt_sisyphus@)
erb-2.7.5-alt1.noarch.rpm: changelog name (majioa@) does not match expected name (alt_sisyphus@)
ri-doc-2.7.5-alt1.noarch.rpm: changelog name (majioa@) does not match expected name (alt_sisyphus@)
libruby-debuginfo-2.7.5-alt1.riscv64.rpm: changelog name (majioa@) does not match expected name (alt_sisyphus@)
irb-2.7.5-alt1.noarch.rpm: changelog name (majioa@) does not match expected name (alt_sisyphus@)
ruby-debuginfo-2.7.5-alt1.riscv64.rpm: changelog name (majioa@) does not match expected name (alt_sisyphus@)
libruby-devel-static-2.7.5-alt1.riscv64.rpm: changelog name (majioa@) does not match expected name (alt_sisyphus@)
ruby-2.7.5-alt1.riscv64.rpm: changelog name (majioa@) does not match expected name (alt_sisyphus@)
ruby-2.7.5-alt1.src.rpm: changelog name (majioa@) does not match expected name (alt_sisyphus@)
2022-Jan-21 14:25:33 :: #100: ruby-2.7.5-alt1.src.rpm: build check OK
riscv64/srpm/gem-setup-5.999.5-alt11.src.rpm: license not found in '/usr/share/license' directory: BSD-2-Clause
riscv64/rpms/gem-setup-doc-5.999.5-alt11.noarch.rpm: license not found in '/usr/share/license' directory: BSD-2-Clause
riscv64/rpms/gem-setup-5.999.5-alt11.noarch.rpm: license not found in '/usr/share/license' directory: BSD-2-Clause
riscv64/rpms/setup-rb-5.999.5-alt11.noarch.rpm: license not found in '/usr/share/license' directory: BSD-2-Clause
gem-setup-doc-5.999.5-alt11.noarch.rpm: changelog name (majioa@) does not match expected name (alt_sisyphus@)
gem-setup-5.999.5-alt11.noarch.rpm: changelog name (majioa@) does not match expected name (alt_sisyphus@)
setup-rb-5.999.5-alt11.noarch.rpm: changelog name (majioa@) does not match expected name (alt_sisyphus@)
gem-setup-5.999.5-alt11.src.rpm: changelog name (majioa@) does not match expected name (alt_sisyphus@)
2022-Jan-21 14:25:34 :: #200: gem-setup-5.999.5-alt11.src.rpm: build check OK
riscv64/srpm/gem-rake-13.0.5-alt1.src.rpm: license not found in '/usr/share/license' directory: MIT
riscv64/rpms/gem-rake-doc-13.0.5-alt1.noarch.rpm: license not found in '/usr/share/license' directory: MIT
riscv64/rpms/rake-13.0.5-alt1.noarch.rpm: license not found in '/usr/share/license' directory: MIT
riscv64/rpms/gem-rake-13.0.5-alt1.noarch.rpm: license not found in '/usr/share/license' directory: MIT
gem-rake-doc-13.0.5-alt1.noarch.rpm: changelog name (majioa@) does not match expected name (alt_sisyphus@)
rake-13.0.5-alt1.noarch.rpm: changelog name (majioa@) does not match expected name (alt_sisyphus@)
gem-rake-13.0.5-alt1.noarch.rpm: changelog name (majioa@) does not match expected name (alt_sisyphus@)
gem-rake-13.0.5-alt1.src.rpm: changelog name (majioa@) does not match expected name (alt_sisyphus@)
2022-Jan-21 14:25:35 :: #300: gem-rake-13.0.5-alt1.src.rpm: build check OK
riscv64/srpm/gem-rspec-support-3.10.2-alt1.src.rpm: license not found in '/usr/share/license' directory: MIT
riscv64/rpms/gem-rspec-support-doc-3.10.2-alt1.noarch.rpm: license not found in '/usr/share/license' directory: MIT
riscv64/rpms/gem-rspec-support-3.10.2-alt1.noarch.rpm: license not found in '/usr/share/license' directory: MIT
gem-rspec-support-doc-3.10.2-alt1.noarch.rpm: changelog name (majioa@) does not match expected name (incominger@)
gem-rspec-support-3.10.2-alt1.noarch.rpm: changelog name (majioa@) does not match expected name (incominger@)
gem-rspec-support-3.10.2-alt1.src.rpm: changelog name (majioa@) does not match expected name (incominger@)
2022-Jan-21 14:25:36 :: #400: gem-rspec-support-3.10.2-alt1.src.rpm: build check OK
riscv64/srpm/gem-hoe-3.22.1-alt1.src.rpm: license not found in '/usr/share/license' directory: MIT
riscv64/rpms/gem-hoe-3.22.1-alt1.noarch.rpm: license not found in '/usr/share/license' directory: MIT
riscv64/rpms/gem-hoe-doc-3.22.1-alt1.noarch.rpm: license not found in '/usr/share/license' directory: MIT
gem-hoe-3.22.1-alt1.noarch.rpm: changelog name (majioa@) does not match expected name (incominger@)
gem-hoe-doc-3.22.1-alt1.noarch.rpm: changelog name (majioa@) does not match expected name (incominger@)
gem-hoe-3.22.1-alt1.src.rpm: changelog name (majioa@) does not match expected name (incominger@)
2022-Jan-21 14:25:37 :: #500: gem-hoe-3.22.1-alt1.src.rpm: build check OK
riscv64/srpm/gem-rspec-expectations-3.10.1-alt1.src.rpm: license not found in '/usr/share/license' directory: MIT
riscv64/rpms/gem-rspec-expectations-devel-3.10.1-alt1.noarch.rpm: license not found in '/usr/share/license' directory: MIT
riscv64/rpms/gem-rspec-expectations-doc-3.10.1-alt1.noarch.rpm: license not found in '/usr/share/license' directory: MIT
riscv64/rpms/gem-rspec-expectations-3.10.1-alt1.noarch.rpm: license not found in '/usr/share/license' directory: MIT
gem-rspec-expectations-devel-3.10.1-alt1.noarch.rpm: changelog name (majioa@) does not match expected name (incominger@)
gem-rspec-expectations-doc-3.10.1-alt1.noarch.rpm: changelog name (majioa@) does not match expected name (incominger@)
gem-rspec-expectations-3.10.1-alt1.noarch.rpm: changelog name (majioa@) does not match expected name (incominger@)
gem-rspec-expectations-3.10.1-alt1.src.rpm: changelog name (majioa@) does not match expected name (incominger@)
2022-Jan-21 14:25:38 :: #600: gem-rspec-expectations-3.10.1-alt1.src.rpm: build check OK
riscv64/srpm/gem-rspec-core-3.10.1-alt1.src.rpm: license not found in '/usr/share/license' directory: MIT
riscv64/rpms/gem-rspec-core-doc-3.10.1-alt1.noarch.rpm: license not found in '/usr/share/license' directory: MIT
riscv64/rpms/rspec-3.10.1-alt1.noarch.rpm: license not found in '/usr/share/license' directory: MIT
riscv64/rpms/gem-rspec-core-devel-3.10.1-alt1.noarch.rpm: license not found in '/usr/share/license' directory: MIT
riscv64/rpms/gem-rspec-core-3.10.1-alt1.noarch.rpm: license not found in '/usr/share/license' directory: MIT
gem-rspec-core-doc-3.10.1-alt1.noarch.rpm: changelog name (majioa@) does not match expected name (incominger@)
rspec-3.10.1-alt1.noarch.rpm: changelog name (majioa@) does not match expected name (incominger@)
gem-rspec-core-devel-3.10.1-alt1.noarch.rpm: changelog name (majioa@) does not match expected name (incominger@)
gem-rspec-core-3.10.1-alt1.noarch.rpm: changelog name (majioa@) does not match expected name (incominger@)
gem-rspec-core-3.10.1-alt1.src.rpm: changelog name (majioa@) does not match expected name (incominger@)
2022-Jan-21 14:25:40 :: #700: gem-rspec-core-3.10.1-alt1.src.rpm: build check OK
riscv64/srpm/gem-diff-lcs-1.4.3-alt1.src.rpm: license not found in '/usr/share/license' directory: MIT
riscv64/srpm/gem-diff-lcs-1.4.3-alt1.src.rpm: license not found in '/usr/share/license' directory: Artistic-2.0
riscv64/srpm/gem-diff-lcs-1.4.3-alt1.src.rpm: license not found in '/usr/share/license' directory: GPL-2.0+
riscv64/rpms/diff-lcs-1.4.3-alt1.noarch.rpm: license not found in '/usr/share/license' directory: MIT
riscv64/rpms/diff-lcs-1.4.3-alt1.noarch.rpm: license not found in '/usr/share/license' directory: Artistic-2.0
riscv64/rpms/diff-lcs-1.4.3-alt1.noarch.rpm: license not found in '/usr/share/license' directory: GPL-2.0+
riscv64/rpms/gem-diff-lcs-doc-1.4.3-alt1.noarch.rpm: license not found in '/usr/share/license' directory: MIT
riscv64/rpms/gem-diff-lcs-doc-1.4.3-alt1.noarch.rpm: license not found in '/usr/share/license' directory: Artistic-2.0
riscv64/rpms/gem-diff-lcs-doc-1.4.3-alt1.noarch.rpm: license not found in '/usr/share/license' directory: GPL-2.0+
riscv64/rpms/gem-diff-lcs-devel-1.4.3-alt1.noarch.rpm: license not found in '/usr/share/license' directory: MIT
riscv64/rpms/gem-diff-lcs-devel-1.4.3-alt1.noarch.rpm: license not found in '/usr/share/license' directory: Artistic-2.0
riscv64/rpms/gem-diff-lcs-devel-1.4.3-alt1.noarch.rpm: license not found in '/usr/share/license' directory: GPL-2.0+
riscv64/rpms/gem-diff-lcs-1.4.3-alt1.noarch.rpm: license not found in '/usr/share/license' directory: MIT
riscv64/rpms/gem-diff-lcs-1.4.3-alt1.noarch.rpm: license not found in '/usr/share/license' directory: Artistic-2.0
riscv64/rpms/gem-diff-lcs-1.4.3-alt1.noarch.rpm: license not found in '/usr/share/license' directory: GPL-2.0+
diff-lcs-1.4.3-alt1.noarch.rpm: changelog name (majioa@) does not match expected name (incominger@)
gem-diff-lcs-doc-1.4.3-alt1.noarch.rpm: changelog name (majioa@) does not match expected name (incominger@)
gem-diff-lcs-devel-1.4.3-alt1.noarch.rpm: changelog name (majioa@) does not match expected name (incominger@)
gem-diff-lcs-1.4.3-alt1.noarch.rpm: changelog name (majioa@) does not match expected name (incominger@)
gem-diff-lcs-1.4.3-alt1.src.rpm: changelog name (majioa@) does not match expected name (incominger@)
2022-Jan-21 14:25:41 :: #1000: gem-diff-lcs-1.4.3-alt1.src.rpm: build check OK
riscv64/srpm/gem-rspec-mocks-3.10.2-alt1.src.rpm: license not found in '/usr/share/license' directory: MIT
riscv64/rpms/gem-rspec-mocks-devel-3.10.2-alt1.noarch.rpm: license not found in '/usr/share/license' directory: MIT
riscv64/rpms/gem-rspec-mocks-doc-3.10.2-alt1.noarch.rpm: license not found in '/usr/share/license' directory: MIT
riscv64/rpms/gem-rspec-mocks-3.10.2-alt1.noarch.rpm: license not found in '/usr/share/license' directory: MIT
gem-rspec-mocks-devel-3.10.2-alt1.noarch.rpm: changelog name (majioa@) does not match expected name (incominger@)
gem-rspec-mocks-doc-3.10.2-alt1.noarch.rpm: changelog name (majioa@) does not match expected name (incominger@)
gem-rspec-mocks-3.10.2-alt1.noarch.rpm: changelog name (majioa@) does not match expected name (incominger@)
gem-rspec-mocks-3.10.2-alt1.src.rpm: changelog name (majioa@) does not match expected name (incominger@)
2022-Jan-21 14:25:43 :: #1100: gem-rspec-mocks-3.10.2-alt1.src.rpm: build check OK
riscv64/srpm/gem-rspec-3.10.0-alt1.src.rpm: license not found in '/usr/share/license' directory: MIT
riscv64/rpms/gem-rspec-3.10.0-alt1.noarch.rpm: license not found in '/usr/share/license' directory: MIT
riscv64/rpms/gem-rspec-doc-3.10.0-alt1.noarch.rpm: license not found in '/usr/share/license' directory: MIT
riscv64/rpms/gem-rspec-devel-3.10.0-alt1.noarch.rpm: license not found in '/usr/share/license' directory: MIT
gem-rspec-3.10.0-alt1.noarch.rpm: changelog name (majioa@) does not match expected name (incominger@)
gem-rspec-doc-3.10.0-alt1.noarch.rpm: changelog name (majioa@) does not match expected name (incominger@)
gem-rspec-devel-3.10.0-alt1.noarch.rpm: changelog name (majioa@) does not match expected name (incominger@)
gem-rspec-3.10.0-alt1.src.rpm: changelog name (majioa@) does not match expected name (incominger@)
2022-Jan-21 14:25:44 :: #1200: gem-rspec-3.10.0-alt1.src.rpm: build check OK
riscv64/srpm/gem-asciidoctor-2.0.16-alt0.1.re.rv64.src.rpm: license not found in '/usr/share/license' directory: MIT
riscv64/rpms/gem-asciidoctor-2.0.16-alt0.1.re.rv64.noarch.rpm: license not found in '/usr/share/license' directory: MIT
2022-Jan-21 14:25:44 :: #1300: gem-asciidoctor-2.0.16-alt0.1.re.rv64.src.rpm: build check OK
riscv64/srpm/gem-ast-2.4.1-alt0.1.re.rv64.src.rpm: license not found in '/usr/share/license' directory: MIT
riscv64/rpms/gem-ast-2.4.1-alt0.1.re.rv64.noarch.rpm: license not found in '/usr/share/license' directory: MIT
2022-Jan-21 14:25:45 :: #1400: gem-ast-2.4.1-alt0.1.re.rv64.src.rpm: build check OK
riscv64/srpm/gem-bacon-1.2.0-alt0.1.re.rv64.src.rpm: license not found in '/usr/share/license' directory: MIT
riscv64/rpms/gem-bacon-1.2.0-alt0.1.re.rv64.noarch.rpm: license not found in '/usr/share/license' directory: MIT
2022-Jan-21 14:25:47 :: #1500: gem-bacon-1.2.0-alt0.1.re.rv64.src.rpm: build check OK
riscv64/srpm/gem-benchmark-ips-2.9.1-alt0.1.re.rv64.src.rpm: license not found in '/usr/share/license' directory: MIT
riscv64/rpms/gem-benchmark-ips-2.9.1-alt0.1.re.rv64.noarch.rpm: license not found in '/usr/share/license' directory: MIT
2022-Jan-21 14:25:48 :: #1600: gem-benchmark-ips-2.9.1-alt0.1.re.rv64.src.rpm: build check OK
riscv64/srpm/gem-builder-3.2.4-alt0.1.re.rv64.src.rpm: license not found in '/usr/share/license' directory: MIT
riscv64/rpms/gem-builder-3.2.4-alt0.1.re.rv64.noarch.rpm: license not found in '/usr/share/license' directory: MIT
2022-Jan-21 14:25:48 :: #1700: gem-builder-3.2.4-alt0.1.re.rv64.src.rpm: build check OK
riscv64/srpm/gem-cliver-0.3.2-alt0.1.re.rv64.src.rpm: license not found in '/usr/share/license' directory: MIT
riscv64/rpms/gem-cliver-0.3.2-alt0.1.re.rv64.noarch.rpm: license not found in '/usr/share/license' directory: MIT
2022-Jan-21 14:25:49 :: #2000: gem-cliver-0.3.2-alt0.1.re.rv64.src.rpm: build check OK
riscv64/srpm/gem-coderay-1.1.3-alt0.1.re.rv64.src.rpm: license not found in '/usr/share/license' directory: MIT
riscv64/rpms/gem-coderay-1.1.3-alt0.1.re.rv64.noarch.rpm: license not found in '/usr/share/license' directory: MIT
2022-Jan-21 14:25:50 :: #2100: gem-coderay-1.1.3-alt0.1.re.rv64.src.rpm: build check OK
riscv64/srpm/gem-coffee-script-2.4.1.1-alt0.1.re.rv64.src.rpm: license not found in '/usr/share/license' directory: MIT
riscv64/rpms/gem-coffee-script-2.4.1.1-alt0.1.re.rv64.noarch.rpm: license not found in '/usr/share/license' directory: MIT
2022-Jan-21 14:25:52 :: #2200: gem-coffee-script-2.4.1.1-alt0.1.re.rv64.src.rpm: build check OK
riscv64/srpm/gem-coffee-script-source-2.1.1-alt0.2.1.re.rv64.src.rpm: license not found in '/usr/share/license' directory: MIT
riscv64/rpms/gem-coffee-script-source-2.1.1-alt0.2.1.re.rv64.noarch.rpm: license not found in '/usr/share/license' directory: MIT
2022-Jan-21 14:25:52 :: #2300: gem-coffee-script-source-2.1.1-alt0.2.1.re.rv64.src.rpm: build check OK
riscv64/srpm/gem-coffee-script-source-compat-1.12.2-alt0.3.re.rv64.src.rpm: license not found in '/usr/share/license' directory: MIT
riscv64/rpms/gem-coffee-script-source-compat-1.12.2-alt0.3.re.rv64.noarch.rpm: license not found in '/usr/share/license' directory: MIT
2022-Jan-21 14:25:53 :: #2400: gem-coffee-script-source-compat-1.12.2-alt0.3.re.rv64.src.rpm: build check OK
riscv64/srpm/gem-commonjs-0.2.7.1-alt0.0.1.re.rv64.src.rpm: license not found in '/usr/share/license' directory: MIT
riscv64/rpms/gem-commonjs-0.2.7.1-alt0.0.1.re.rv64.noarch.rpm: license not found in '/usr/share/license' directory: MIT
2022-Jan-21 14:25:54 :: #2500: gem-commonjs-0.2.7.1-alt0.0.1.re.rv64.src.rpm: build check OK
riscv64/srpm/gem-connection-pool-2.2.5-alt0.1.re.rv64.src.rpm: license not found in '/usr/share/license' directory: MIT
riscv64/rpms/gem-connection-pool-2.2.5-alt0.1.re.rv64.noarch.rpm: license not found in '/usr/share/license' directory: MIT
2022-Jan-21 14:25:55 :: #2600: gem-connection-pool-2.2.5-alt0.1.re.rv64.src.rpm: build check OK
riscv64/srpm/gem-coveralls-0.8.23.1-alt0.0.1.re.rv64.src.rpm: license not found in '/usr/share/license' directory: MIT
riscv64/rpms/gem-coveralls-0.8.23.1-alt0.0.1.re.rv64.noarch.rpm: license not found in '/usr/share/license' directory: MIT
2022-Jan-21 14:25:55 :: #2700: gem-coveralls-0.8.23.1-alt0.0.1.re.rv64.src.rpm: build check OK
riscv64/srpm/gem-crass-1.0.5-alt0.1.re.rv64.src.rpm: license not found in '/usr/share/license' directory: MIT
riscv64/rpms/gem-crass-1.0.5-alt0.1.re.rv64.noarch.rpm: license not found in '/usr/share/license' directory: MIT
2022-Jan-21 14:25:56 :: #3000: gem-crass-1.0.5-alt0.1.re.rv64.src.rpm: build check OK
riscv64/srpm/gem-creole-0.5.0.1-alt0.0.1.re.rv64.src.rpm: license not found in '/usr/share/license' directory: Ruby
riscv64/rpms/gem-creole-0.5.0.1-alt0.0.1.re.rv64.noarch.rpm: license not found in '/usr/share/license' directory: Ruby
2022-Jan-21 14:25:57 :: #3100: gem-creole-0.5.0.1-alt0.0.1.re.rv64.src.rpm: build check OK
riscv64/srpm/gem-docile-1.3.5-alt0.1.re.rv64.src.rpm: license not found in '/usr/share/license' directory: MIT
riscv64/rpms/gem-docile-1.3.5-alt0.1.re.rv64.noarch.rpm: license not found in '/usr/share/license' directory: MIT
2022-Jan-21 14:25:57 :: #3200: gem-docile-1.3.5-alt0.1.re.rv64.src.rpm: build check OK
riscv64/srpm/gem-erubi-1.10.0-alt0.1.re.rv64.src.rpm: license not found in '/usr/share/license' directory: MIT
riscv64/rpms/gem-erubi-1.10.0-alt0.1.re.rv64.noarch.rpm: license not found in '/usr/share/license' directory: MIT
2022-Jan-21 14:25:58 :: #3300: gem-erubi-1.10.0-alt0.1.re.rv64.src.rpm: build check OK
riscv64/srpm/gem-erubis-2.7.0-alt0.5.re.rv64.src.rpm: license not found in '/usr/share/license' directory: MIT
riscv64/rpms/gem-erubis-2.7.0-alt0.5.re.rv64.noarch.rpm: license not found in '/usr/share/license' directory: MIT
2022-Jan-21 14:25:59 :: #3400: gem-erubis-2.7.0-alt0.5.re.rv64.src.rpm: build check OK
riscv64/srpm/gem-execjs-2.7.0.1-alt0.0.1.re.rv64.src.rpm: license not found in '/usr/share/license' directory: MIT
riscv64/rpms/gem-execjs-2.7.0.1-alt0.0.1.re.rv64.noarch.rpm: license not found in '/usr/share/license' directory: MIT
2022-Jan-21 14:26:00 :: #3500: gem-execjs-2.7.0.1-alt0.0.1.re.rv64.src.rpm: build check OK
riscv64/srpm/gem-expression-parser-0.9.1-alt0.1.1.re.rv64.src.rpm: license not found in '/usr/share/license' directory: MIT
riscv64/rpms/gem-expression-parser-0.9.1-alt0.1.1.re.rv64.noarch.rpm: license not found in '/usr/share/license' directory: MIT
2022-Jan-21 14:26:00 :: #3600: gem-expression-parser-0.9.1-alt0.1.1.re.rv64.src.rpm: build check OK
riscv64/srpm/gem-gauntlet-2.1.0-alt0.1.re.rv64.src.rpm: license not found in '/usr/share/license' directory: MIT
riscv64/rpms/gem-gauntlet-2.1.0-alt0.1.re.rv64.noarch.rpm: license not found in '/usr/share/license' directory: MIT
2022-Jan-21 14:26:01 :: #3700: gem-gauntlet-2.1.0-alt0.1.re.rv64.src.rpm: build check OK
riscv64/srpm/gem-gettext-3.3.5-alt0.1.re.rv64.src.rpm: license not found in '/usr/share/license' directory: GPLv2
riscv64/rpms/gem-gettext-3.3.5-alt0.1.re.rv64.noarch.rpm: license not found in '/usr/share/license' directory: GPLv2
2022-Jan-21 14:26:02 :: #4000: gem-gettext-3.3.5-alt0.1.re.rv64.src.rpm: build check OK
riscv64/srpm/gem-globalid-0.4.2-alt0.1.re.rv64.src.rpm: license not found in '/usr/share/license' directory: MIT
riscv64/rpms/gem-globalid-0.4.2-alt0.1.re.rv64.noarch.rpm: license not found in '/usr/share/license' directory: MIT
2022-Jan-21 14:26:03 :: #4100: gem-globalid-0.4.2-alt0.1.re.rv64.src.rpm: build check OK
riscv64/srpm/gem-haml-5.2.2-alt0.1.re.rv64.src.rpm: license not found in '/usr/share/license' directory: MIT
riscv64/rpms/gem-haml-5.2.2-alt0.1.re.rv64.noarch.rpm: license not found in '/usr/share/license' directory: MIT
2022-Jan-21 14:26:03 :: #4200: gem-haml-5.2.2-alt0.1.re.rv64.src.rpm: build check OK
riscv64/srpm/gem-hansi-0.2.0-alt0.1.re.rv64.src.rpm: license not found in '/usr/share/license' directory: MIT
riscv64/rpms/gem-hansi-0.2.0-alt0.1.re.rv64.noarch.rpm: license not found in '/usr/share/license' directory: MIT
2022-Jan-21 14:26:04 :: #4300: gem-hansi-0.2.0-alt0.1.re.rv64.src.rpm: build check OK
riscv64/srpm/gem-htmlentities-4.3.3-alt0.1.1.re.rv64.src.rpm: license not found in '/usr/share/license' directory: MIT
riscv64/rpms/gem-htmlentities-4.3.3-alt0.1.1.re.rv64.noarch.rpm: license not found in '/usr/share/license' directory: MIT
2022-Jan-21 14:26:04 :: #4400: gem-htmlentities-4.3.3-alt0.1.1.re.rv64.src.rpm: build check OK
riscv64/srpm/gem-i18n-1.8.3-alt0.1.re.rv64.src.rpm: license not found in '/usr/share/license' directory: MIT
riscv64/rpms/gem-i18n-1.8.3-alt0.1.re.rv64.noarch.rpm: license not found in '/usr/share/license' directory: MIT
2022-Jan-21 14:26:05 :: #4500: gem-i18n-1.8.3-alt0.1.re.rv64.src.rpm: build check OK
riscv64/srpm/gem-kramdown-2.3.1-alt0.3.re.rv64.src.rpm: license not found in '/usr/share/license' directory: MIT
riscv64/rpms/gem-kramdown-2.3.1-alt0.3.re.rv64.noarch.rpm: license not found in '/usr/share/license' directory: MIT
2022-Jan-21 14:26:06 :: #4600: gem-kramdown-2.3.1-alt0.3.re.rv64.src.rpm: build check OK
2022-Jan-21 14:26:06 :: #4700: gem-less-2.6.0-alt0.2.re.rv64.src.rpm: build check OK
riscv64/srpm/gem-liquid-5.0.1-alt0.1.re.rv64.src.rpm: license not found in '/usr/share/license' directory: MIT
riscv64/rpms/gem-liquid-5.0.1-alt0.1.re.rv64.noarch.rpm: license not found in '/usr/share/license' directory: MIT
2022-Jan-21 14:26:07 :: #5000: gem-liquid-5.0.1-alt0.1.re.rv64.src.rpm: build check OK
riscv64/srpm/gem-locale-2.1.3-alt0.1.re.rv64.src.rpm: license not found in '/usr/share/license' directory: MIT
riscv64/rpms/gem-locale-2.1.3-alt0.1.re.rv64.noarch.rpm: license not found in '/usr/share/license' directory: MIT
2022-Jan-21 14:26:07 :: #5100: gem-locale-2.1.3-alt0.1.re.rv64.src.rpm: build check OK
riscv64/srpm/gem-loofah-2.12.0-alt0.1.re.rv64.src.rpm: license not found in '/usr/share/license' directory: MIT
riscv64/rpms/gem-loofah-2.12.0-alt0.1.re.rv64.noarch.rpm: license not found in '/usr/share/license' directory: MIT
2022-Jan-21 14:26:08 :: #5200: gem-loofah-2.12.0-alt0.1.re.rv64.src.rpm: build check OK
riscv64/srpm/gem-mail-2.7.1.1-alt0.0.1.re.rv64.src.rpm: license not found in '/usr/share/license' directory: MIT
riscv64/rpms/gem-mail-2.7.1.1-alt0.0.1.re.rv64.noarch.rpm: license not found in '/usr/share/license' directory: MIT
2022-Jan-21 14:26:08 :: #5300: gem-mail-2.7.1.1-alt0.0.1.re.rv64.src.rpm: build check OK
riscv64/srpm/gem-marcel-1.0.1-alt0.1.re.rv64.src.rpm: license not found in '/usr/share/license' directory: MIT
riscv64/rpms/gem-marcel-1.0.1-alt0.1.re.rv64.noarch.rpm: license not found in '/usr/share/license' directory: MIT
2022-Jan-21 14:26:09 :: #5400: gem-marcel-1.0.1-alt0.1.re.rv64.src.rpm: build check OK
riscv64/srpm/gem-markaby-0.9.0.1-alt0.0.1.re.rv64.src.rpm: license not found in '/usr/share/license' directory: MIT
riscv64/rpms/gem-markaby-0.9.0.1-alt0.0.1.re.rv64.noarch.rpm: license not found in '/usr/share/license' directory: MIT
2022-Jan-21 14:26:10 :: #5500: gem-markaby-0.9.0.1-alt0.0.1.re.rv64.src.rpm: build check OK
riscv64/srpm/gem-method-source-1.0.0-alt0.1.re.rv64.src.rpm: license not found in '/usr/share/license' directory: MIT
riscv64/rpms/gem-method-source-1.0.0-alt0.1.re.rv64.noarch.rpm: license not found in '/usr/share/license' directory: MIT
2022-Jan-21 14:26:10 :: #5600: gem-method-source-1.0.0-alt0.1.re.rv64.src.rpm: build check OK
riscv64/srpm/gem-mimemagic-0.3.5-alt0.1.re.rv64.src.rpm: license not found in '/usr/share/license' directory: MIT
riscv64/rpms/gem-mimemagic-0.3.5-alt0.1.re.rv64.noarch.rpm: license not found in '/usr/share/license' directory: MIT
2022-Jan-21 14:26:11 :: #5700: gem-mimemagic-0.3.5-alt0.1.re.rv64.src.rpm: build check OK
riscv64/srpm/gem-mini-mime-1.1.0-alt0.1.re.rv64.src.rpm: license not found in '/usr/share/license' directory: MIT
riscv64/rpms/gem-mini-mime-1.1.0-alt0.1.re.rv64.noarch.rpm: license not found in '/usr/share/license' directory: MIT
2022-Jan-21 14:26:11 :: #6000: gem-mini-mime-1.1.0-alt0.1.re.rv64.src.rpm: build check OK
riscv64/srpm/gem-minitest-5.14.4-alt0.1.re.rv64.src.rpm: license not found in '/usr/share/license' directory: MIT
riscv64/rpms/gem-minitest-5.14.4-alt0.1.re.rv64.noarch.rpm: license not found in '/usr/share/license' directory: MIT
2022-Jan-21 14:26:12 :: #6100: gem-minitest-5.14.4-alt0.1.re.rv64.src.rpm: build check OK
riscv64/srpm/gem-minitest-global-expectations-1.0.1-alt0.1.re.rv64.src.rpm: license not found in '/usr/share/license' directory: MIT
riscv64/rpms/gem-minitest-global-expectations-1.0.1-alt0.1.re.rv64.noarch.rpm: license not found in '/usr/share/license' directory: MIT
2022-Jan-21 14:26:12 :: #6200: gem-minitest-global-expectations-1.0.1-alt0.1.re.rv64.src.rpm: build check OK
riscv64/srpm/gem-mocha-1.11.2-alt0.1.re.rv64.src.rpm: license not found in '/usr/share/license' directory: MIT
riscv64/rpms/gem-mocha-1.11.2-alt0.1.re.rv64.noarch.rpm: license not found in '/usr/share/license' directory: MIT
2022-Jan-21 14:26:13 :: #6300: gem-mocha-1.11.2-alt0.1.re.rv64.src.rpm: build check OK
riscv64/srpm/gem-multi-json-1.15.0-alt0.1.re.rv64.src.rpm: license not found in '/usr/share/license' directory: MIT
riscv64/rpms/gem-multi-json-1.15.0-alt0.1.re.rv64.noarch.rpm: license not found in '/usr/share/license' directory: MIT
2022-Jan-21 14:26:13 :: #6400: gem-multi-json-1.15.0-alt0.1.re.rv64.src.rpm: build check OK
riscv64/srpm/gem-mustermann-1.1.1-alt0.1.1.re.rv64.src.rpm: license not found in '/usr/share/license' directory: MIT
riscv64/rpms/gem-mustermann-1.1.1-alt0.1.1.re.rv64.noarch.rpm: license not found in '/usr/share/license' directory: MIT
2022-Jan-21 14:26:14 :: #6500: gem-mustermann-1.1.1-alt0.1.1.re.rv64.src.rpm: build check OK
riscv64/srpm/gem-net-http-persistent-4.0.0-alt0.1.re.rv64.src.rpm: license not found in '/usr/share/license' directory: MIT
riscv64/rpms/gem-net-http-persistent-4.0.0-alt0.1.re.rv64.noarch.rpm: license not found in '/usr/share/license' directory: MIT
2022-Jan-21 14:26:14 :: #6600: gem-net-http-persistent-4.0.0-alt0.1.re.rv64.src.rpm: build check OK
riscv64/srpm/gem-packnga-1.0.4-alt0.1.re.rv64.src.rpm: license not found in '/usr/share/license' directory: LGPLv2
riscv64/rpms/gem-packnga-1.0.4-alt0.1.re.rv64.noarch.rpm: license not found in '/usr/share/license' directory: LGPLv2
2022-Jan-21 14:26:15 :: #6700: gem-packnga-1.0.4-alt0.1.re.rv64.src.rpm: build check OK
riscv64/srpm/gem-parallel-1.20.2-alt0.1.re.rv64.src.rpm: license not found in '/usr/share/license' directory: MIT
riscv64/rpms/gem-parallel-1.20.2-alt0.1.re.rv64.noarch.rpm: license not found in '/usr/share/license' directory: MIT
2022-Jan-21 14:26:15 :: #7000: gem-parallel-1.20.2-alt0.1.re.rv64.src.rpm: build check OK
riscv64/srpm/gem-parser-3.0.1.1-alt0.1.re.rv64.src.rpm: license not found in '/usr/share/license' directory: MIT
riscv64/rpms/gem-parser-3.0.1.1-alt0.1.re.rv64.noarch.rpm: license not found in '/usr/share/license' directory: MIT
2022-Jan-21 14:26:16 :: #7100: gem-parser-3.0.1.1-alt0.1.re.rv64.src.rpm: build check OK
riscv64/srpm/gem-permessage-deflate-0.1.4-alt0.1.re.rv64.src.rpm: license not found in '/usr/share/license' directory: MIT
riscv64/rpms/gem-permessage-deflate-0.1.4-alt0.1.re.rv64.noarch.rpm: license not found in '/usr/share/license' directory: MIT
2022-Jan-21 14:26:17 :: #7200: gem-permessage-deflate-0.1.4-alt0.1.re.rv64.src.rpm: build check OK
riscv64/srpm/gem-power-assert-1.1.7-alt0.1.re.rv64.src.rpm: license not found in '/usr/share/license' directory: BSD-2-Clause
riscv64/srpm/gem-power-assert-1.1.7-alt0.1.re.rv64.src.rpm: license not found in '/usr/share/license' directory: Ruby
riscv64/rpms/gem-power-assert-1.1.7-alt0.1.re.rv64.noarch.rpm: license not found in '/usr/share/license' directory: BSD-2-Clause
riscv64/rpms/gem-power-assert-1.1.7-alt0.1.re.rv64.noarch.rpm: license not found in '/usr/share/license' directory: Ruby
2022-Jan-21 14:26:17 :: #7300: gem-power-assert-1.1.7-alt0.1.re.rv64.src.rpm: build check OK
riscv64/srpm/gem-pry-0.14.1-alt0.1.re.rv64.src.rpm: license not found in '/usr/share/license' directory: MIT
riscv64/rpms/gem-pry-0.14.1-alt0.1.re.rv64.noarch.rpm: license not found in '/usr/share/license' directory: MIT
2022-Jan-21 14:26:18 :: #7500: gem-pry-0.14.1-alt0.1.re.rv64.src.rpm: build check OK
riscv64/srpm/gem-rack-2.2.2-alt0.1.re.rv64.src.rpm: license not found in '/usr/share/license' directory: MIT
riscv64/rpms/gem-rack-2.2.2-alt0.1.re.rv64.noarch.rpm: license not found in '/usr/share/license' directory: MIT
2022-Jan-21 14:26:18 :: #7600: gem-rack-2.2.2-alt0.1.re.rv64.src.rpm: build check OK
riscv64/srpm/gem-rack-test-1.1.0.1-alt0.1.re.rv64.src.rpm: license not found in '/usr/share/license' directory: MIT
riscv64/rpms/gem-rack-test-1.1.0.1-alt0.1.re.rv64.noarch.rpm: license not found in '/usr/share/license' directory: MIT
2022-Jan-21 14:26:19 :: #7700: gem-rack-test-1.1.0.1-alt0.1.re.rv64.src.rpm: build check OK
riscv64/srpm/gem-radius-0.8.0-alt0.0.1.re.rv64.src.rpm: license not found in '/usr/share/license' directory: MIT
riscv64/rpms/gem-radius-0.8.0-alt0.0.1.re.rv64.noarch.rpm: license not found in '/usr/share/license' directory: MIT
2022-Jan-21 14:26:19 :: #10000: gem-radius-0.8.0-alt0.0.1.re.rv64.src.rpm: build check OK
riscv64/srpm/gem-rails-dom-testing-2.0.3-alt0.2.re.rv64.src.rpm: license not found in '/usr/share/license' directory: MIT
riscv64/rpms/gem-rails-dom-testing-2.0.3-alt0.2.re.rv64.noarch.rpm: license not found in '/usr/share/license' directory: MIT
2022-Jan-21 14:26:20 :: #10200: gem-rails-dom-testing-2.0.3-alt0.2.re.rv64.src.rpm: build check OK
riscv64/srpm/gem-rails-html-sanitizer-1.3.0-alt0.1.re.rv64.src.rpm: license not found in '/usr/share/license' directory: MIT
riscv64/rpms/gem-rails-html-sanitizer-1.3.0-alt0.1.re.rv64.noarch.rpm: license not found in '/usr/share/license' directory: MIT
2022-Jan-21 14:26:20 :: #10300: gem-rails-html-sanitizer-1.3.0-alt0.1.re.rv64.src.rpm: build check OK
riscv64/srpm/gem-rainbow-3.1.0-alt0.1.re.rv64.src.rpm: license not found in '/usr/share/license' directory: MIT
riscv64/rpms/gem-rainbow-3.1.0-alt0.1.re.rv64.noarch.rpm: license not found in '/usr/share/license' directory: MIT
2022-Jan-21 14:26:21 :: #10400: gem-rainbow-3.1.0-alt0.1.re.rv64.src.rpm: build check OK
riscv64/srpm/gem-rbench-0.2.4-alt0.1.re.rv64.src.rpm: license not found in '/usr/share/license' directory: MIT
riscv64/rpms/gem-rbench-0.2.4-alt0.1.re.rv64.noarch.rpm: license not found in '/usr/share/license' directory: MIT
2022-Jan-21 14:26:21 :: #10500: gem-rbench-0.2.4-alt0.1.re.rv64.src.rpm: build check OK
riscv64/srpm/gem-rb-fsevent-0.11.0-alt0.1.re.rv64.src.rpm: license not found in '/usr/share/license' directory: MIT
riscv64/rpms/gem-rb-fsevent-0.11.0-alt0.1.re.rv64.noarch.rpm: license not found in '/usr/share/license' directory: MIT
2022-Jan-21 14:26:22 :: #10600: gem-rb-fsevent-0.11.0-alt0.1.re.rv64.src.rpm: build check OK
riscv64/srpm/gem-rb-inotify-0.10.1-alt0.1.re.rv64.src.rpm: license not found in '/usr/share/license' directory: MIT
riscv64/rpms/gem-rb-inotify-0.10.1-alt0.1.re.rv64.noarch.rpm: license not found in '/usr/share/license' directory: MIT
2022-Jan-21 14:26:23 :: #10700: gem-rb-inotify-0.10.1-alt0.1.re.rv64.src.rpm: build check OK
riscv64/srpm/gem-redcloth-4.3.2-alt0.3.re.rv64.src.rpm: license not found in '/usr/share/license' directory: MIT
riscv64/rpms/gem-redcloth-4.3.2-alt0.3.re.rv64.noarch.rpm: license not found in '/usr/share/license' directory: MIT
2022-Jan-21 14:26:23 :: #11000: gem-redcloth-4.3.2-alt0.3.re.rv64.src.rpm: build check OK
riscv64/srpm/gem-regexp-parser-1.8.2-alt0.1.re.rv64.src.rpm: license not found in '/usr/share/license' directory: MIT
riscv64/rpms/gem-regexp-parser-1.8.2-alt0.1.re.rv64.noarch.rpm: license not found in '/usr/share/license' directory: MIT
2022-Jan-21 14:26:24 :: #11100: gem-regexp-parser-1.8.2-alt0.1.re.rv64.src.rpm: build check OK
riscv64/srpm/gem-rexml-3.2.5-alt0.1.re.rv64.src.rpm: license not found in '/usr/share/license' directory: BSD-2-Clause
riscv64/rpms/gem-rexml-3.2.5-alt0.1.re.rv64.noarch.rpm: license not found in '/usr/share/license' directory: BSD-2-Clause
2022-Jan-21 14:26:25 :: #11200: gem-rexml-3.2.5-alt0.1.re.rv64.src.rpm: build check OK
riscv64/srpm/gem-rouge-3.26.0-alt0.1.re.rv64.src.rpm: license not found in '/usr/share/license' directory: MIT
riscv64/srpm/gem-rouge-3.26.0-alt0.1.re.rv64.src.rpm: license not found in '/usr/share/license' directory: BSD-2-Clause
riscv64/rpms/gem-rouge-3.26.0-alt0.1.re.rv64.noarch.rpm: license not found in '/usr/share/license' directory: MIT
riscv64/rpms/gem-rouge-3.26.0-alt0.1.re.rv64.noarch.rpm: license not found in '/usr/share/license' directory: BSD-2-Clause
2022-Jan-21 14:26:25 :: #11300: gem-rouge-3.26.0-alt0.1.re.rv64.src.rpm: build check OK
riscv64/srpm/gem-rr-3.0.4-alt0.1.re.rv64.src.rpm: license not found in '/usr/share/license' directory: MIT
riscv64/rpms/gem-rr-3.0.4-alt0.1.re.rv64.noarch.rpm: license not found in '/usr/share/license' directory: MIT
2022-Jan-21 14:26:26 :: #11400: gem-rr-3.0.4-alt0.1.re.rv64.src.rpm: build check OK
riscv64/srpm/gem-rubocop-1.15.0-alt0.1.re.rv64.src.rpm: license not found in '/usr/share/license' directory: MIT
riscv64/rpms/gem-rubocop-1.15.0-alt0.1.re.rv64.noarch.rpm: license not found in '/usr/share/license' directory: MIT
2022-Jan-21 14:26:27 :: #11500: gem-rubocop-1.15.0-alt0.1.re.rv64.src.rpm: build check OK
riscv64/srpm/gem-rubocop-ast-1.7.0-alt0.1.re.rv64.src.rpm: license not found in '/usr/share/license' directory: MIT
riscv64/rpms/gem-rubocop-ast-1.7.0-alt0.1.re.rv64.noarch.rpm: license not found in '/usr/share/license' directory: MIT
2022-Jan-21 14:26:27 :: #11600: gem-rubocop-ast-1.7.0-alt0.1.re.rv64.src.rpm: build check OK
riscv64/srpm/gem-rubocop-discourse-2.4.2-alt0.1.re.rv64.src.rpm: license not found in '/usr/share/license' directory: MIT
riscv64/rpms/gem-rubocop-discourse-2.4.2-alt0.1.re.rv64.noarch.rpm: license not found in '/usr/share/license' directory: MIT
2022-Jan-21 14:26:28 :: #11700: gem-rubocop-discourse-2.4.2-alt0.1.re.rv64.src.rpm: build check OK
riscv64/srpm/gem-rubocop-performance-1.11.3-alt0.1.re.rv64.src.rpm: license not found in '/usr/share/license' directory: MIT
riscv64/rpms/gem-rubocop-performance-1.11.3-alt0.1.re.rv64.noarch.rpm: license not found in '/usr/share/license' directory: MIT
2022-Jan-21 14:26:29 :: #12000: gem-rubocop-performance-1.11.3-alt0.1.re.rv64.src.rpm: build check OK
riscv64/srpm/gem-rubocop-rspec-2.4.0-alt0.1.re.rv64.src.rpm: license not found in '/usr/share/license' directory: MIT
riscv64/rpms/gem-rubocop-rspec-2.4.0-alt0.1.re.rv64.noarch.rpm: license not found in '/usr/share/license' directory: MIT
2022-Jan-21 14:26:29 :: #12100: gem-rubocop-rspec-2.4.0-alt0.1.re.rv64.src.rpm: build check OK
riscv64/srpm/gem-ruby2-keywords-0.0.4-alt0.1.re.rv64.src.rpm: license not found in '/usr/share/license' directory: Ruby
riscv64/srpm/gem-ruby2-keywords-0.0.4-alt0.1.re.rv64.src.rpm: license not found in '/usr/share/license' directory: BSD-2-Clause
riscv64/rpms/gem-ruby2-keywords-0.0.4-alt0.1.re.rv64.noarch.rpm: license not found in '/usr/share/license' directory: Ruby
riscv64/rpms/gem-ruby2-keywords-0.0.4-alt0.1.re.rv64.noarch.rpm: license not found in '/usr/share/license' directory: BSD-2-Clause
2022-Jan-21 14:26:30 :: #12200: gem-ruby2-keywords-0.0.4-alt0.1.re.rv64.src.rpm: build check OK
riscv64/srpm/gem-sass-3.7.4-alt0.2.1.re.rv64.src.rpm: license not found in '/usr/share/license' directory: MIT
riscv64/rpms/gem-sass-3.7.4-alt0.2.1.re.rv64.noarch.rpm: license not found in '/usr/share/license' directory: MIT
2022-Jan-21 14:26:31 :: #12400: gem-sass-3.7.4-alt0.2.1.re.rv64.src.rpm: build check OK
riscv64/srpm/gem-sass-listen-4.0.0-alt0.3.re.rv64.src.rpm: license not found in '/usr/share/license' directory: MIT
riscv64/rpms/gem-sass-listen-4.0.0-alt0.3.re.rv64.noarch.rpm: license not found in '/usr/share/license' directory: MIT
2022-Jan-21 14:26:32 :: #12500: gem-sass-listen-4.0.0-alt0.3.re.rv64.src.rpm: build check OK
riscv64/srpm/gem-simplecov-0.21.2-alt0.1.re.rv64.src.rpm: license not found in '/usr/share/license' directory: MIT
riscv64/rpms/gem-simplecov-0.21.2-alt0.1.re.rv64.noarch.rpm: license not found in '/usr/share/license' directory: MIT
2022-Jan-21 14:26:32 :: #12600: gem-simplecov-0.21.2-alt0.1.re.rv64.src.rpm: build check OK
riscv64/srpm/gem-simplecov-html-0.12.3-alt0.1.re.rv64.src.rpm: license not found in '/usr/share/license' directory: MIT
riscv64/rpms/gem-simplecov-html-0.12.3-alt0.1.re.rv64.noarch.rpm: license not found in '/usr/share/license' directory: MIT
2022-Jan-21 14:26:33 :: #12700: gem-simplecov-html-0.12.3-alt0.1.re.rv64.src.rpm: build check OK
riscv64/srpm/gem-simplecov-json-formatter-0.1.2-alt0.1.re.rv64.src.rpm: license not found in '/usr/share/license' directory: MIT
riscv64/rpms/gem-simplecov-json-formatter-0.1.2-alt0.1.re.rv64.noarch.rpm: license not found in '/usr/share/license' directory: MIT
2022-Jan-21 14:26:34 :: #13000: gem-simplecov-json-formatter-0.1.2-alt0.1.re.rv64.src.rpm: build check OK
riscv64/srpm/gem-sinatra-2.1.0-alt0.1.re.rv64.src.rpm: license not found in '/usr/share/license' directory: MIT
riscv64/rpms/gem-sinatra-2.1.0-alt0.1.re.rv64.noarch.rpm: license not found in '/usr/share/license' directory: MIT
2022-Jan-21 14:26:35 :: #13100: gem-sinatra-2.1.0-alt0.1.re.rv64.src.rpm: build check OK
riscv64/srpm/gem-slim-4.1.0-alt0.1.re.rv64.src.rpm: license not found in '/usr/share/license' directory: MIT
riscv64/rpms/gem-slim-4.1.0-alt0.1.re.rv64.noarch.rpm: license not found in '/usr/share/license' directory: MIT
2022-Jan-21 14:26:35 :: #13200: gem-slim-4.1.0-alt0.1.re.rv64.src.rpm: build check OK
riscv64/srpm/gem-sprockets-4.0.2.1-alt0.1.re.rv64.src.rpm: license not found in '/usr/share/license' directory: MIT
riscv64/rpms/gem-sprockets-4.0.2.1-alt0.1.re.rv64.noarch.rpm: license not found in '/usr/share/license' directory: MIT
2022-Jan-21 14:26:36 :: #13300: gem-sprockets-4.0.2.1-alt0.1.re.rv64.src.rpm: build check OK
riscv64/srpm/gem-sprockets-rails-3.2.2-alt0.1.re.rv64.src.rpm: license not found in '/usr/share/license' directory: MIT
riscv64/rpms/gem-sprockets-rails-3.2.2-alt0.1.re.rv64.noarch.rpm: license not found in '/usr/share/license' directory: MIT
2022-Jan-21 14:26:37 :: #13400: gem-sprockets-rails-3.2.2-alt0.1.re.rv64.src.rpm: build check OK
riscv64/srpm/gem-stringex-2.8.5-alt0.1.re.rv64.src.rpm: license not found in '/usr/share/license' directory: MIT
riscv64/rpms/gem-stringex-2.8.5-alt0.1.re.rv64.noarch.rpm: license not found in '/usr/share/license' directory: MIT
2022-Jan-21 14:26:38 :: #13500: gem-stringex-2.8.5-alt0.1.re.rv64.src.rpm: build check OK
riscv64/srpm/gem-temple-0.8.2-alt0.1.re.rv64.src.rpm: license not found in '/usr/share/license' directory: MIT
riscv64/rpms/gem-temple-0.8.2-alt0.1.re.rv64.noarch.rpm: license not found in '/usr/share/license' directory: MIT
2022-Jan-21 14:26:41 :: #13600: gem-temple-0.8.2-alt0.1.re.rv64.src.rpm: build check OK
riscv64/srpm/gem-test-unit-3.3.5-alt0.1.re.rv64.src.rpm: license not found in '/usr/share/license' directory: GPLv2
riscv64/rpms/gem-test-unit-3.3.5-alt0.1.re.rv64.noarch.rpm: license not found in '/usr/share/license' directory: GPLv2
2022-Jan-21 14:26:42 :: #13700: gem-test-unit-3.3.5-alt0.1.re.rv64.src.rpm: build check OK
riscv64/srpm/gem-text-1.3.1-alt0.5.re.rv64.src.rpm: license not found in '/usr/share/license' directory: MIT
riscv64/rpms/gem-text-1.3.1-alt0.5.re.rv64.noarch.rpm: license not found in '/usr/share/license' directory: MIT
2022-Jan-21 14:26:43 :: #14000: gem-text-1.3.1-alt0.5.re.rv64.src.rpm: build check OK
riscv64/srpm/gem-tilt-2.0.10.1-alt0.1.re.rv64.src.rpm: license not found in '/usr/share/license' directory: MIT
riscv64/rpms/gem-tilt-2.0.10.1-alt0.1.re.rv64.noarch.rpm: license not found in '/usr/share/license' directory: MIT
2022-Jan-21 14:26:44 :: #14200: gem-tilt-2.0.10.1-alt0.1.re.rv64.src.rpm: build check OK
2022-Jan-21 14:26:45 :: #14300: gem-twitter-text-3.1.0-alt0.1.re.rv64.src.rpm: build check OK
riscv64/srpm/gem-tzinfo-2.0.4-alt0.1.re.rv64.src.rpm: license not found in '/usr/share/license' directory: MIT
riscv64/rpms/gem-tzinfo-2.0.4-alt0.1.re.rv64.noarch.rpm: license not found in '/usr/share/license' directory: MIT
2022-Jan-21 14:26:46 :: #14400: gem-tzinfo-2.0.4-alt0.1.re.rv64.src.rpm: build check OK
riscv64/srpm/gem-unf-0.2.0-alt0.0.1.re.rv64.src.rpm: license not found in '/usr/share/license' directory: BSD-2-Clause
riscv64/rpms/gem-unf-0.2.0-alt0.0.1.re.rv64.noarch.rpm: license not found in '/usr/share/license' directory: BSD-2-Clause
2022-Jan-21 14:26:47 :: #14500: gem-unf-0.2.0-alt0.0.1.re.rv64.src.rpm: build check OK
riscv64/srpm/gem-unicode-display-width-2.0.0-alt0.1.re.rv64.src.rpm: license not found in '/usr/share/license' directory: MIT
riscv64/rpms/gem-unicode-display-width-2.0.0-alt0.1.re.rv64.noarch.rpm: license not found in '/usr/share/license' directory: MIT
2022-Jan-21 14:26:48 :: #14600: gem-unicode-display-width-2.0.0-alt0.1.re.rv64.src.rpm: build check OK
2022-Jan-21 14:26:50 :: #14700: gem-websocket-extensions-0.1.5-alt0.1.re.rv64.src.rpm: build check OK
riscv64/srpm/gem-wikicloth-0.8.3.1-alt0.1.re.rv64.src.rpm: license not found in '/usr/share/license' directory: MIT
riscv64/rpms/gem-wikicloth-0.8.3.1-alt0.1.re.rv64.noarch.rpm: license not found in '/usr/share/license' directory: MIT
2022-Jan-21 14:26:51 :: #15000: gem-wikicloth-0.8.3.1-alt0.1.re.rv64.src.rpm: build check OK
riscv64/srpm/gem-yard-0.9.25-alt0.1.re.rv64.src.rpm: license not found in '/usr/share/license' directory: MIT
riscv64/rpms/gem-yard-0.9.25-alt0.1.re.rv64.noarch.rpm: license not found in '/usr/share/license' directory: MIT
2022-Jan-21 14:26:52 :: #15100: gem-yard-0.9.25-alt0.1.re.rv64.src.rpm: build check OK
riscv64/srpm/gem-zeitwerk-2.4.2-alt0.1.re.rv64.src.rpm: license not found in '/usr/share/license' directory: MIT
riscv64/rpms/gem-zeitwerk-2.4.2-alt0.1.re.rv64.noarch.rpm: license not found in '/usr/share/license' directory: MIT
2022-Jan-21 14:26:53 :: #15200: gem-zeitwerk-2.4.2-alt0.1.re.rv64.src.rpm: build check OK
2022-Jan-21 14:26:54 :: #15300: ruby-timecop-0.9.1-alt0.1.re.rv64.src.rpm: build check OK
riscv64/srpm/gem-rdoc-6.3.0-alt1.src.rpm: license not found in '/usr/share/license' directory: Ruby
riscv64/rpms/ri-6.3.0-alt1.noarch.rpm: license not found in '/usr/share/license' directory: Ruby
riscv64/rpms/gem-rdoc-doc-6.3.0-alt1.noarch.rpm: license not found in '/usr/share/license' directory: Ruby
riscv64/rpms/gem-rdoc-6.3.0-alt1.noarch.rpm: license not found in '/usr/share/license' directory: Ruby
riscv64/rpms/rdoc-6.3.0-alt1.noarch.rpm: license not found in '/usr/share/license' directory: Ruby
ri-6.3.0-alt1.noarch.rpm: changelog name (majioa@) does not match expected name (incominger@)
gem-rdoc-doc-6.3.0-alt1.noarch.rpm: changelog name (majioa@) does not match expected name (incominger@)
gem-rdoc-6.3.0-alt1.noarch.rpm: changelog name (majioa@) does not match expected name (incominger@)
rdoc-6.3.0-alt1.noarch.rpm: changelog name (majioa@) does not match expected name (incominger@)
gem-rdoc-6.3.0-alt1.src.rpm: changelog name (majioa@) does not match expected name (incominger@)
2022-Jan-21 14:26:57 :: #20400: gem-rdoc-6.3.0-alt1.src.rpm: build check OK
riscv64/srpm/gem-thor-1.0.1-alt1.src.rpm: license not found in '/usr/share/license' directory: MIT
riscv64/rpms/gem-thor-1.0.1-alt1.noarch.rpm: license not found in '/usr/share/license' directory: MIT
riscv64/rpms/thor-1.0.1-alt1.noarch.rpm: license not found in '/usr/share/license' directory: MIT
riscv64/rpms/gem-thor-doc-1.0.1-alt1.noarch.rpm: license not found in '/usr/share/license' directory: MIT
gem-thor-1.0.1-alt1.noarch.rpm: changelog name (majioa@) does not match expected name (incominger@)
thor-1.0.1-alt1.noarch.rpm: changelog name (majioa@) does not match expected name (incominger@)
gem-thor-doc-1.0.1-alt1.noarch.rpm: changelog name (majioa@) does not match expected name (incominger@)
gem-thor-1.0.1-alt1.src.rpm: changelog name (majioa@) does not match expected name (incominger@)
2022-Jan-21 14:26:58 :: #20500: gem-thor-1.0.1-alt1.src.rpm: build check OK
riscv64/srpm/libcaca-0.99-alt22.src.rpm: license not found in '/usr/share/license' directory: WTFPL
riscv64/rpms/ruby-caca-0.99-alt22.riscv64.rpm: license not found in '/usr/share/license' directory: WTFPL
riscv64/rpms/libcaca-0.99-alt22.riscv64.rpm: license not found in '/usr/share/license' directory: WTFPL
riscv64/rpms/ruby-caca-debuginfo-0.99-alt22.riscv64.rpm: license not found in '/usr/share/license' directory: WTFPL
riscv64/rpms/caca-utils-debuginfo-0.99-alt22.riscv64.rpm: license not found in '/usr/share/license' directory: WTFPL
riscv64/rpms/python3-module-caca-0.99-alt22.noarch.rpm: license not found in '/usr/share/license' directory: WTFPL
riscv64/rpms/caca-utils-0.99-alt22.riscv64.rpm: license not found in '/usr/share/license' directory: WTFPL
riscv64/rpms/libcaca-devel-0.99-alt22.riscv64.rpm: license not found in '/usr/share/license' directory: WTFPL
riscv64/rpms/libcaca-debuginfo-0.99-alt22.riscv64.rpm: license not found in '/usr/share/license' directory: WTFPL
ruby-caca-0.99-alt22.riscv64.rpm: changelog name (majioa@) does not match expected name (alt_sisyphus@)
libcaca-0.99-alt22.riscv64.rpm: changelog name (majioa@) does not match expected name (alt_sisyphus@)
ruby-caca-debuginfo-0.99-alt22.riscv64.rpm: changelog name (majioa@) does not match expected name (alt_sisyphus@)
caca-utils-debuginfo-0.99-alt22.riscv64.rpm: changelog name (majioa@) does not match expected name (alt_sisyphus@)
python3-module-caca-0.99-alt22.noarch.rpm: changelog name (majioa@) does not match expected name (alt_sisyphus@)
caca-utils-0.99-alt22.riscv64.rpm: changelog name (majioa@) does not match expected name (alt_sisyphus@)
libcaca-devel-0.99-alt22.riscv64.rpm: changelog name (majioa@) does not match expected name (alt_sisyphus@)
libcaca-debuginfo-0.99-alt22.riscv64.rpm: changelog name (majioa@) does not match expected name (alt_sisyphus@)
libcaca-0.99-alt22.src.rpm: changelog name (majioa@) does not match expected name (alt_sisyphus@)
2022-Jan-21 14:27:00 :: #21000: libcaca-0.99-alt22.src.rpm: build check OK
riscv64/srpm/xapian-bindings-1.4.15-alt3.src.rpm: license not found in '/usr/share/license' directory: GPL-2.0+
riscv64/rpms/ruby-xapian-1.4.15-alt3.riscv64.rpm: license not found in '/usr/share/license' directory: GPL-2.0+
riscv64/rpms/python3-module-xapian-1.4.15-alt3.riscv64.rpm: license not found in '/usr/share/license' directory: GPL-2.0+
riscv64/rpms/python-module-xapian-debuginfo-1.4.15-alt3.riscv64.rpm: license not found in '/usr/share/license' directory: GPL-2.0+
riscv64/rpms/ruby-xapian-debuginfo-1.4.15-alt3.riscv64.rpm: license not found in '/usr/share/license' directory: GPL-2.0+
riscv64/rpms/python-module-xapian-1.4.15-alt3.riscv64.rpm: license not found in '/usr/share/license' directory: GPL-2.0+
riscv64/rpms/python3-module-xapian-debuginfo-1.4.15-alt3.riscv64.rpm: license not found in '/usr/share/license' directory: GPL-2.0+
ruby-xapian-1.4.15-alt3.riscv64.rpm: changelog name (vt@) does not match expected name (alt_sisyphus@)
python3-module-xapian-1.4.15-alt3.riscv64.rpm: changelog name (vt@) does not match expected name (alt_sisyphus@)
python-module-xapian-debuginfo-1.4.15-alt3.riscv64.rpm: changelog name (vt@) does not match expected name (alt_sisyphus@)
ruby-xapian-debuginfo-1.4.15-alt3.riscv64.rpm: changelog name (vt@) does not match expected name (alt_sisyphus@)
python-module-xapian-1.4.15-alt3.riscv64.rpm: changelog name (vt@) does not match expected name (alt_sisyphus@)
python3-module-xapian-debuginfo-1.4.15-alt3.riscv64.rpm: changelog name (vt@) does not match expected name (alt_sisyphus@)
xapian-bindings-1.4.15-alt3.src.rpm: changelog name (vt@) does not match expected name (alt_sisyphus@)
2022-Jan-21 14:27:02 :: #21100: xapian-bindings-1.4.15-alt3.src.rpm: build check OK
riscv64/srpm/gem-nio4r-2.5.2-alt1.src.rpm: license not found in '/usr/share/license' directory: MIT
riscv64/rpms/gem-nio4r-2.5.2-alt1.riscv64.rpm: license not found in '/usr/share/license' directory: MIT
riscv64/rpms/gem-nio4r-debuginfo-2.5.2-alt1.riscv64.rpm: license not found in '/usr/share/license' directory: MIT
riscv64/rpms/gem-nio4r-devel-2.5.2-alt1.noarch.rpm: license not found in '/usr/share/license' directory: MIT
riscv64/rpms/gem-nio4r-doc-2.5.2-alt1.noarch.rpm: license not found in '/usr/share/license' directory: MIT
gem-nio4r-2.5.2-alt1.riscv64.rpm: changelog name (majioa@) does not match expected name (incominger@)
gem-nio4r-debuginfo-2.5.2-alt1.riscv64.rpm: changelog name (majioa@) does not match expected name (incominger@)
gem-nio4r-devel-2.5.2-alt1.noarch.rpm: changelog name (majioa@) does not match expected name (incominger@)
gem-nio4r-doc-2.5.2-alt1.noarch.rpm: changelog name (majioa@) does not match expected name (incominger@)
gem-nio4r-2.5.2-alt1.src.rpm: changelog name (majioa@) does not match expected name (incominger@)
2022-Jan-21 14:27:03 :: #21600: gem-nio4r-2.5.2-alt1.src.rpm: build check OK
riscv64/srpm/gem-redcarpet-3.5.0-alt1.src.rpm: license not found in '/usr/share/license' directory: MIT
riscv64/rpms/gem-redcarpet-debuginfo-3.5.0-alt1.riscv64.rpm: license not found in '/usr/share/license' directory: MIT
riscv64/rpms/gem-redcarpet-doc-3.5.0-alt1.noarch.rpm: license not found in '/usr/share/license' directory: MIT
riscv64/rpms/gem-redcarpet-3.5.0-alt1.riscv64.rpm: license not found in '/usr/share/license' directory: MIT
riscv64/rpms/redcarpet-3.5.0-alt1.noarch.rpm: license not found in '/usr/share/license' directory: MIT
riscv64/rpms/gem-redcarpet-devel-3.5.0-alt1.noarch.rpm: license not found in '/usr/share/license' directory: MIT
gem-redcarpet-debuginfo-3.5.0-alt1.riscv64.rpm: changelog name (majioa@) does not match expected name (incominger@)
gem-redcarpet-doc-3.5.0-alt1.noarch.rpm: changelog name (majioa@) does not match expected name (incominger@)
gem-redcarpet-3.5.0-alt1.riscv64.rpm: changelog name (majioa@) does not match expected name (incominger@)
redcarpet-3.5.0-alt1.noarch.rpm: changelog name (majioa@) does not match expected name (incominger@)
gem-redcarpet-devel-3.5.0-alt1.noarch.rpm: changelog name (majioa@) does not match expected name (incominger@)
gem-redcarpet-3.5.0-alt1.src.rpm: changelog name (majioa@) does not match expected name (incominger@)
2022-Jan-21 14:27:06 :: #21700: gem-redcarpet-3.5.0-alt1.src.rpm: build check OK
riscv64/srpm/gem-rake-compiler-dock-1.1.0-alt1.src.rpm: license not found in '/usr/share/license' directory: MIT
riscv64/rpms/gem-rake-compiler-dock-devel-1.1.0-alt1.noarch.rpm: license not found in '/usr/share/license' directory: MIT
riscv64/rpms/gem-rake-compiler-dock-doc-1.1.0-alt1.noarch.rpm: license not found in '/usr/share/license' directory: MIT
riscv64/rpms/gem-rake-compiler-dock-1.1.0-alt1.noarch.rpm: license not found in '/usr/share/license' directory: MIT
riscv64/rpms/rake-compiler-dock-1.1.0-alt1.noarch.rpm: license not found in '/usr/share/license' directory: MIT
gem-rake-compiler-dock-devel-1.1.0-alt1.noarch.rpm: changelog name (majioa@) does not match expected name (incominger@)
gem-rake-compiler-dock-doc-1.1.0-alt1.noarch.rpm: changelog name (majioa@) does not match expected name (incominger@)
gem-rake-compiler-dock-1.1.0-alt1.noarch.rpm: changelog name (majioa@) does not match expected name (incominger@)
rake-compiler-dock-1.1.0-alt1.noarch.rpm: changelog name (majioa@) does not match expected name (incominger@)
gem-rake-compiler-dock-1.1.0-alt1.src.rpm: changelog name (majioa@) does not match expected name (incominger@)
2022-Jan-21 14:27:07 :: #22000: gem-rake-compiler-dock-1.1.0-alt1.src.rpm: build check OK
riscv64/srpm/gem-json-2.5.1-alt1.src.rpm: license not found in '/usr/share/license' directory: Ruby
riscv64/rpms/gem-json-pure-doc-2.5.1-alt1.noarch.rpm: license not found in '/usr/share/license' directory: Ruby
riscv64/rpms/gem-json-debuginfo-2.5.1-alt1.riscv64.rpm: license not found in '/usr/share/license' directory: Ruby
riscv64/rpms/gem-json-devel-2.5.1-alt1.noarch.rpm: license not found in '/usr/share/license' directory: Ruby
riscv64/rpms/gem-json-pure-devel-2.5.1-alt1.noarch.rpm: license not found in '/usr/share/license' directory: Ruby
riscv64/rpms/gem-json-2.5.1-alt1.riscv64.rpm: license not found in '/usr/share/license' directory: Ruby
riscv64/rpms/gem-json-doc-2.5.1-alt1.noarch.rpm: license not found in '/usr/share/license' directory: Ruby
riscv64/rpms/gem-json-pure-2.5.1-alt1.noarch.rpm: license not found in '/usr/share/license' directory: Ruby
gem-json-pure-doc-2.5.1-alt1.noarch.rpm: changelog name (majioa@) does not match expected name (incominger@)
gem-json-debuginfo-2.5.1-alt1.riscv64.rpm: changelog name (majioa@) does not match expected name (incominger@)
gem-json-devel-2.5.1-alt1.noarch.rpm: changelog name (majioa@) does not match expected name (incominger@)
gem-json-pure-devel-2.5.1-alt1.noarch.rpm: changelog name (majioa@) does not match expected name (incominger@)
gem-json-2.5.1-alt1.riscv64.rpm: changelog name (majioa@) does not match expected name (incominger@)
gem-json-doc-2.5.1-alt1.noarch.rpm: changelog name (majioa@) does not match expected name (incominger@)
gem-json-pure-2.5.1-alt1.noarch.rpm: changelog name (majioa@) does not match expected name (incominger@)
gem-json-2.5.1-alt1.src.rpm: changelog name (majioa@) does not match expected name (incominger@)
2022-Jan-21 14:27:09 :: #22100: gem-json-2.5.1-alt1.src.rpm: build check OK
riscv64/srpm/gem-concurrent-ruby-1.1.7-alt2.src.rpm: license not found in '/usr/share/license' directory: MIT
riscv64/rpms/gem-concurrent-ruby-edge-0.6.0-alt2.noarch.rpm: license not found in '/usr/share/license' directory: MIT
riscv64/rpms/gem-concurrent-ruby-1.1.7-alt2.riscv64.rpm: license not found in '/usr/share/license' directory: MIT
riscv64/rpms/gem-concurrent-ruby-doc-1.1.7-alt2.noarch.rpm: license not found in '/usr/share/license' directory: MIT
riscv64/rpms/gem-concurrent-ruby-ext-devel-1.1.7-alt2.noarch.rpm: license not found in '/usr/share/license' directory: MIT
riscv64/rpms/gem-concurrent-ruby-ext-debuginfo-1.1.7-alt2.riscv64.rpm: license not found in '/usr/share/license' directory: MIT
riscv64/rpms/gem-concurrent-ruby-edge-doc-0.6.0-alt2.noarch.rpm: license not found in '/usr/share/license' directory: MIT
riscv64/rpms/gem-concurrent-ruby-ext-1.1.7-alt2.riscv64.rpm: license not found in '/usr/share/license' directory: MIT
gem-concurrent-ruby-edge-0.6.0-alt2.noarch.rpm: changelog name (majioa@) does not match expected name (incominger@)
gem-concurrent-ruby-1.1.7-alt2.riscv64.rpm: changelog name (majioa@) does not match expected name (incominger@)
gem-concurrent-ruby-doc-1.1.7-alt2.noarch.rpm: changelog name (majioa@) does not match expected name (incominger@)
gem-concurrent-ruby-ext-devel-1.1.7-alt2.noarch.rpm: changelog name (majioa@) does not match expected name (incominger@)
gem-concurrent-ruby-ext-debuginfo-1.1.7-alt2.riscv64.rpm: changelog name (majioa@) does not match expected name (incominger@)
gem-concurrent-ruby-edge-doc-0.6.0-alt2.noarch.rpm: changelog name (majioa@) does not match expected name (incominger@)
gem-concurrent-ruby-ext-1.1.7-alt2.riscv64.rpm: changelog name (majioa@) does not match expected name (incominger@)
gem-concurrent-ruby-1.1.7-alt2.src.rpm: changelog name (majioa@) does not match expected name (incominger@)
2022-Jan-21 14:27:11 :: #22200: gem-concurrent-ruby-1.1.7-alt2.src.rpm: build check OK
riscv64/srpm/gem-hoe-markdown-1.4.0-alt1.src.rpm: license not found in '/usr/share/license' directory: MIT
riscv64/rpms/gem-hoe-markdown-devel-1.4.0-alt1.noarch.rpm: license not found in '/usr/share/license' directory: MIT
riscv64/rpms/gem-hoe-markdown-doc-1.4.0-alt1.noarch.rpm: license not found in '/usr/share/license' directory: MIT
riscv64/rpms/gem-hoe-markdown-1.4.0-alt1.noarch.rpm: license not found in '/usr/share/license' directory: MIT
gem-hoe-markdown-devel-1.4.0-alt1.noarch.rpm: changelog name (majioa@) does not match expected name (alt_sisyphus@)
gem-hoe-markdown-doc-1.4.0-alt1.noarch.rpm: changelog name (majioa@) does not match expected name (alt_sisyphus@)
gem-hoe-markdown-1.4.0-alt1.noarch.rpm: changelog name (majioa@) does not match expected name (alt_sisyphus@)
gem-hoe-markdown-1.4.0-alt1.src.rpm: changelog name (majioa@) does not match expected name (alt_sisyphus@)
2022-Jan-21 14:27:12 :: #22300: gem-hoe-markdown-1.4.0-alt1.src.rpm: build check OK
riscv64/srpm/gem-oj-3.10.5-alt1.1.src.rpm: license not found in '/usr/share/license' directory: MIT
riscv64/rpms/gem-oj-devel-3.10.5-alt1.1.noarch.rpm: license not found in '/usr/share/license' directory: MIT
riscv64/rpms/gem-oj-doc-3.10.5-alt1.1.noarch.rpm: license not found in '/usr/share/license' directory: MIT
riscv64/rpms/gem-oj-debuginfo-3.10.5-alt1.1.riscv64.rpm: license not found in '/usr/share/license' directory: MIT
riscv64/rpms/gem-oj-3.10.5-alt1.1.riscv64.rpm: license not found in '/usr/share/license' directory: MIT
gem-oj-devel-3.10.5-alt1.1.noarch.rpm: changelog name (majioa@) does not match expected name (incominger@)
gem-oj-doc-3.10.5-alt1.1.noarch.rpm: changelog name (majioa@) does not match expected name (incominger@)
gem-oj-debuginfo-3.10.5-alt1.1.riscv64.rpm: changelog name (majioa@) does not match expected name (incominger@)
gem-oj-3.10.5-alt1.1.riscv64.rpm: changelog name (majioa@) does not match expected name (incominger@)
gem-oj-3.10.5-alt1.1.src.rpm: changelog name (majioa@) does not match expected name (incominger@)
2022-Jan-21 14:27:14 :: #22400: gem-oj-3.10.5-alt1.1.src.rpm: build check OK
gem-idn-ruby-devel-0.1.0-alt2.1.noarch.rpm: changelog name (majioa@) does not match expected name (incominger@)
gem-idn-ruby-debuginfo-0.1.0-alt2.1.riscv64.rpm: changelog name (majioa@) does not match expected name (incominger@)
gem-idn-ruby-0.1.0-alt2.1.riscv64.rpm: changelog name (majioa@) does not match expected name (incominger@)
gem-idn-ruby-0.1.0-alt2.1.src.rpm: changelog name (majioa@) does not match expected name (incominger@)
2022-Jan-21 14:27:15 :: #22500: gem-idn-ruby-0.1.0-alt2.1.src.rpm: build check OK
riscv64/srpm/gem-rake-compiler-1.1.2-alt1.src.rpm: license not found in '/usr/share/license' directory: MIT
riscv64/rpms/rake-compiler-1.1.2-alt1.noarch.rpm: license not found in '/usr/share/license' directory: MIT
riscv64/rpms/gem-rake-compiler-doc-1.1.2-alt1.noarch.rpm: license not found in '/usr/share/license' directory: MIT
riscv64/rpms/gem-rake-compiler-1.1.2-alt1.noarch.rpm: license not found in '/usr/share/license' directory: MIT
riscv64/rpms/gem-rake-compiler-devel-1.1.2-alt1.noarch.rpm: license not found in '/usr/share/license' directory: MIT
rake-compiler-1.1.2-alt1.noarch.rpm: changelog name (majioa@) does not match expected name (incominger@)
gem-rake-compiler-doc-1.1.2-alt1.noarch.rpm: changelog name (majioa@) does not match expected name (incominger@)
gem-rake-compiler-1.1.2-alt1.noarch.rpm: changelog name (majioa@) does not match expected name (incominger@)
gem-rake-compiler-devel-1.1.2-alt1.noarch.rpm: changelog name (majioa@) does not match expected name (incominger@)
gem-rake-compiler-1.1.2-alt1.src.rpm: changelog name (majioa@) does not match expected name (incominger@)
2022-Jan-21 14:27:16 :: #22600: gem-rake-compiler-1.1.2-alt1.src.rpm: build check OK
riscv64/srpm/gem-ffi-1.15.4-alt1.src.rpm: license not found in '/usr/share/license' directory: BSD-3-Clause
riscv64/rpms/gem-ffi-devel-1.15.4-alt1.noarch.rpm: license not found in '/usr/share/license' directory: BSD-3-Clause
riscv64/rpms/gem-ffi-doc-1.15.4-alt1.noarch.rpm: license not found in '/usr/share/license' directory: BSD-3-Clause
riscv64/rpms/gem-ffi-1.15.4-alt1.riscv64.rpm: license not found in '/usr/share/license' directory: BSD-3-Clause
riscv64/rpms/gem-ffi-debuginfo-1.15.4-alt1.riscv64.rpm: license not found in '/usr/share/license' directory: BSD-3-Clause
gem-ffi-devel-1.15.4-alt1.noarch.rpm: changelog name (majioa@) does not match expected name (alt_sisyphus@)
gem-ffi-doc-1.15.4-alt1.noarch.rpm: changelog name (majioa@) does not match expected name (alt_sisyphus@)
gem-ffi-1.15.4-alt1.riscv64.rpm: changelog name (majioa@) does not match expected name (alt_sisyphus@)
gem-ffi-debuginfo-1.15.4-alt1.riscv64.rpm: changelog name (majioa@) does not match expected name (alt_sisyphus@)
gem-ffi-1.15.4-alt1.src.rpm: changelog name (majioa@) does not match expected name (alt_sisyphus@)
2022-Jan-21 14:27:18 :: #23000: gem-ffi-1.15.4-alt1.src.rpm: build check OK
riscv64/srpm/gem-yajl-ruby-1.4.1-alt3.src.rpm: license not found in '/usr/share/license' directory: MIT
riscv64/rpms/gem-yajl-ruby-doc-1.4.1-alt3.noarch.rpm: license not found in '/usr/share/license' directory: MIT
riscv64/rpms/gem-yajl-ruby-1.4.1-alt3.riscv64.rpm: license not found in '/usr/share/license' directory: MIT
riscv64/rpms/gem-yajl-ruby-devel-1.4.1-alt3.noarch.rpm: license not found in '/usr/share/license' directory: MIT
riscv64/rpms/gem-yajl-ruby-debuginfo-1.4.1-alt3.riscv64.rpm: license not found in '/usr/share/license' directory: MIT
gem-yajl-ruby-doc-1.4.1-alt3.noarch.rpm: changelog name (majioa@) does not match expected name (incominger@)
gem-yajl-ruby-1.4.1-alt3.riscv64.rpm: changelog name (majioa@) does not match expected name (incominger@)
gem-yajl-ruby-devel-1.4.1-alt3.noarch.rpm: changelog name (majioa@) does not match expected name (incominger@)
gem-yajl-ruby-debuginfo-1.4.1-alt3.riscv64.rpm: changelog name (majioa@) does not match expected name (incominger@)
gem-yajl-ruby-1.4.1-alt3.src.rpm: changelog name (majioa@) does not match expected name (incominger@)
2022-Jan-21 14:27:19 :: #23100: gem-yajl-ruby-1.4.1-alt3.src.rpm: build check OK
riscv64/srpm/gem-eventmachine-1.3.0.dev.1-alt1.src.rpm: license not found in '/usr/share/license' directory: Ruby
riscv64/srpm/gem-eventmachine-1.3.0.dev.1-alt1.src.rpm: license not found in '/usr/share/license' directory: GPL-2.0
riscv64/rpms/gem-eventmachine-1.3.0.dev.1-alt1.riscv64.rpm: license not found in '/usr/share/license' directory: Ruby
riscv64/rpms/gem-eventmachine-1.3.0.dev.1-alt1.riscv64.rpm: license not found in '/usr/share/license' directory: GPL-2.0
riscv64/rpms/gem-eventmachine-devel-1.3.0.dev.1-alt1.noarch.rpm: license not found in '/usr/share/license' directory: Ruby
riscv64/rpms/gem-eventmachine-devel-1.3.0.dev.1-alt1.noarch.rpm: license not found in '/usr/share/license' directory: GPL-2.0
riscv64/rpms/gem-eventmachine-doc-1.3.0.dev.1-alt1.noarch.rpm: license not found in '/usr/share/license' directory: Ruby
riscv64/rpms/gem-eventmachine-doc-1.3.0.dev.1-alt1.noarch.rpm: license not found in '/usr/share/license' directory: GPL-2.0
riscv64/rpms/gem-eventmachine-debuginfo-1.3.0.dev.1-alt1.riscv64.rpm: license not found in '/usr/share/license' directory: Ruby
riscv64/rpms/gem-eventmachine-debuginfo-1.3.0.dev.1-alt1.riscv64.rpm: license not found in '/usr/share/license' directory: GPL-2.0
gem-eventmachine-1.3.0.dev.1-alt1.riscv64.rpm: changelog name (majioa@) does not match expected name (alt_sisyphus@)
gem-eventmachine-devel-1.3.0.dev.1-alt1.noarch.rpm: changelog name (majioa@) does not match expected name (alt_sisyphus@)
gem-eventmachine-doc-1.3.0.dev.1-alt1.noarch.rpm: changelog name (majioa@) does not match expected name (alt_sisyphus@)
gem-eventmachine-debuginfo-1.3.0.dev.1-alt1.riscv64.rpm: changelog name (majioa@) does not match expected name (alt_sisyphus@)
gem-eventmachine-1.3.0.dev.1-alt1.src.rpm: changelog name (majioa@) does not match expected name (alt_sisyphus@)
2022-Jan-21 14:27:20 :: #23200: gem-eventmachine-1.3.0.dev.1-alt1.src.rpm: build check OK
gem-websocket-driver-debuginfo-0.7.5-alt1.riscv64.rpm: changelog name (majioa@) does not match expected name (incominger@)
gem-websocket-driver-doc-0.7.5-alt1.noarch.rpm: changelog name (majioa@) does not match expected name (incominger@)
gem-websocket-driver-0.7.5-alt1.riscv64.rpm: changelog name (majioa@) does not match expected name (incominger@)
gem-websocket-driver-devel-0.7.5-alt1.noarch.rpm: changelog name (majioa@) does not match expected name (incominger@)
gem-websocket-driver-0.7.5-alt1.src.rpm: changelog name (majioa@) does not match expected name (incominger@)
2022-Jan-21 14:27:22 :: #23300: gem-websocket-driver-0.7.5-alt1.src.rpm: build check OK
riscv64/srpm/gem-gem-hadar-1.11.0-alt1.src.rpm: license not found in '/usr/share/license' directory: MIT
riscv64/rpms/gem-gem-hadar-1.11.0-alt1.noarch.rpm: license not found in '/usr/share/license' directory: MIT
riscv64/rpms/gem-gem-hadar-doc-1.11.0-alt1.noarch.rpm: license not found in '/usr/share/license' directory: MIT
riscv64/rpms/gem-gem-hadar-devel-1.11.0-alt1.noarch.rpm: license not found in '/usr/share/license' directory: MIT
gem-gem-hadar-1.11.0-alt1.noarch.rpm: changelog name (majioa@) does not match expected name (alt_sisyphus@)
gem-gem-hadar-doc-1.11.0-alt1.noarch.rpm: changelog name (majioa@) does not match expected name (alt_sisyphus@)
gem-gem-hadar-devel-1.11.0-alt1.noarch.rpm: changelog name (majioa@) does not match expected name (alt_sisyphus@)
gem-gem-hadar-1.11.0-alt1.src.rpm: changelog name (majioa@) does not match expected name (alt_sisyphus@)
2022-Jan-21 14:27:22 :: #23500: gem-gem-hadar-1.11.0-alt1.src.rpm: build check OK
term-utils-1.7.1-alt1.1.noarch.rpm: changelog name (majioa@) does not match expected name (alt_sisyphus@)
gem-term-ansicolor-devel-1.7.1-alt1.1.noarch.rpm: changelog name (majioa@) does not match expected name (alt_sisyphus@)
gem-term-ansicolor-doc-1.7.1-alt1.1.noarch.rpm: changelog name (majioa@) does not match expected name (alt_sisyphus@)
gem-term-ansicolor-1.7.1-alt1.1.noarch.rpm: changelog name (majioa@) does not match expected name (alt_sisyphus@)
gem-term-ansicolor-1.7.1-alt1.1.src.rpm: changelog name (majioa@) does not match expected name (alt_sisyphus@)
2022-Jan-21 14:27:24 :: #23600: gem-term-ansicolor-1.7.1-alt1.1.src.rpm: build check OK
riscv64/srpm/gem-xmlrpc-0.3.2-alt1.src.rpm: license not found in '/usr/share/license' directory: Ruby
riscv64/srpm/gem-xmlrpc-0.3.2-alt1.src.rpm: license not found in '/usr/share/license' directory: BSD-2-Clause
riscv64/rpms/gem-xmlrpc-devel-0.3.2-alt1.noarch.rpm: license not found in '/usr/share/license' directory: Ruby
riscv64/rpms/gem-xmlrpc-devel-0.3.2-alt1.noarch.rpm: license not found in '/usr/share/license' directory: BSD-2-Clause
riscv64/rpms/gem-xmlrpc-0.3.2-alt1.noarch.rpm: license not found in '/usr/share/license' directory: Ruby
riscv64/rpms/gem-xmlrpc-0.3.2-alt1.noarch.rpm: license not found in '/usr/share/license' directory: BSD-2-Clause
riscv64/rpms/gem-xmlrpc-doc-0.3.2-alt1.noarch.rpm: license not found in '/usr/share/license' directory: Ruby
riscv64/rpms/gem-xmlrpc-doc-0.3.2-alt1.noarch.rpm: license not found in '/usr/share/license' directory: BSD-2-Clause
gem-xmlrpc-devel-0.3.2-alt1.noarch.rpm: changelog name (majioa@) does not match expected name (alt_sisyphus@)
gem-xmlrpc-0.3.2-alt1.noarch.rpm: changelog name (majioa@) does not match expected name (alt_sisyphus@)
gem-xmlrpc-doc-0.3.2-alt1.noarch.rpm: changelog name (majioa@) does not match expected name (alt_sisyphus@)
gem-xmlrpc-0.3.2-alt1.src.rpm: changelog name (majioa@) does not match expected name (alt_sisyphus@)
2022-Jan-21 14:27:25 :: #23700: gem-xmlrpc-0.3.2-alt1.src.rpm: build check OK
riscv64/srpm/gem-webrick-1.7.0-alt1.src.rpm: license not found in '/usr/share/license' directory: MIT
riscv64/rpms/gem-webrick-1.7.0-alt1.noarch.rpm: license not found in '/usr/share/license' directory: MIT
riscv64/rpms/gem-webrick-doc-1.7.0-alt1.noarch.rpm: license not found in '/usr/share/license' directory: MIT
gem-webrick-1.7.0-alt1.noarch.rpm: changelog name (majioa@) does not match expected name (incominger@)
gem-webrick-doc-1.7.0-alt1.noarch.rpm: changelog name (majioa@) does not match expected name (incominger@)
gem-webrick-1.7.0-alt1.src.rpm: changelog name (majioa@) does not match expected name (incominger@)
2022-Jan-21 14:27:25 :: #24000: gem-webrick-1.7.0-alt1.src.rpm: build check OK
riscv64/srpm/gem-mspec-1.8.0-alt1.src.rpm: license not found in '/usr/share/license' directory: Ruby
riscv64/rpms/gem-mspec-doc-1.8.0-alt1.noarch.rpm: license not found in '/usr/share/license' directory: Ruby
riscv64/rpms/mkspec-1.8.0-alt1.noarch.rpm: license not found in '/usr/share/license' directory: Ruby
riscv64/rpms/gem-mspec-devel-1.8.0-alt1.noarch.rpm: license not found in '/usr/share/license' directory: Ruby
riscv64/rpms/gem-mspec-1.8.0-alt1.noarch.rpm: license not found in '/usr/share/license' directory: Ruby
gem-mspec-doc-1.8.0-alt1.noarch.rpm: changelog name (majioa@) does not match expected name (alt_sisyphus@)
mkspec-1.8.0-alt1.noarch.rpm: changelog name (majioa@) does not match expected name (alt_sisyphus@)
gem-mspec-devel-1.8.0-alt1.noarch.rpm: changelog name (majioa@) does not match expected name (alt_sisyphus@)
gem-mspec-1.8.0-alt1.noarch.rpm: changelog name (majioa@) does not match expected name (alt_sisyphus@)
gem-mspec-1.8.0-alt1.src.rpm: changelog name (majioa@) does not match expected name (alt_sisyphus@)
2022-Jan-21 14:27:27 :: #24100: gem-mspec-1.8.0-alt1.src.rpm: build check OK
riscv64/srpm/gem-net-telnet-0.2.0.1-alt0.1.src.rpm: license not found in '/usr/share/license' directory: ruby
riscv64/rpms/gem-net-telnet-0.2.0.1-alt0.1.noarch.rpm: license not found in '/usr/share/license' directory: ruby
riscv64/rpms/gem-net-telnet-devel-0.2.0.1-alt0.1.noarch.rpm: license not found in '/usr/share/license' directory: ruby
riscv64/rpms/gem-net-telnet-doc-0.2.0.1-alt0.1.noarch.rpm: license not found in '/usr/share/license' directory: ruby
gem-net-telnet-0.2.0.1-alt0.1.noarch.rpm: changelog name (majioa@) does not match expected name (alt_sisyphus@)
gem-net-telnet-devel-0.2.0.1-alt0.1.noarch.rpm: changelog name (majioa@) does not match expected name (alt_sisyphus@)
gem-net-telnet-doc-0.2.0.1-alt0.1.noarch.rpm: changelog name (majioa@) does not match expected name (alt_sisyphus@)
gem-net-telnet-0.2.0.1-alt0.1.src.rpm: changelog name (majioa@) does not match expected name (alt_sisyphus@)
2022-Jan-21 14:27:27 :: #24200: gem-net-telnet-0.2.0.1-alt0.1.src.rpm: build check OK
riscv64/srpm/gem-hpricot-0.8.6-alt4.3.src.rpm: license not found in '/usr/share/license' directory: MIT
riscv64/rpms/gem-hpricot-devel-0.8.6-alt4.3.noarch.rpm: license not found in '/usr/share/license' directory: MIT
riscv64/rpms/gem-hpricot-debuginfo-0.8.6-alt4.3.riscv64.rpm: license not found in '/usr/share/license' directory: MIT
riscv64/rpms/gem-hpricot-doc-0.8.6-alt4.3.noarch.rpm: license not found in '/usr/share/license' directory: MIT
riscv64/rpms/gem-hpricot-0.8.6-alt4.3.riscv64.rpm: license not found in '/usr/share/license' directory: MIT
gem-hpricot-devel-0.8.6-alt4.3.noarch.rpm: changelog name (majioa@) does not match expected name (incominger@)
gem-hpricot-debuginfo-0.8.6-alt4.3.riscv64.rpm: changelog name (majioa@) does not match expected name (incominger@)
gem-hpricot-doc-0.8.6-alt4.3.noarch.rpm: changelog name (majioa@) does not match expected name (incominger@)
gem-hpricot-0.8.6-alt4.3.riscv64.rpm: changelog name (majioa@) does not match expected name (incominger@)
gem-hpricot-0.8.6-alt4.3.src.rpm: changelog name (majioa@) does not match expected name (incominger@)
2022-Jan-21 14:27:29 :: #24400: gem-hpricot-0.8.6-alt4.3.src.rpm: build check OK
riscv64/srpm/gem-sync-0.5.0-alt1.src.rpm: license not found in '/usr/share/license' directory: BSD-2-Clause
riscv64/rpms/gem-sync-devel-0.5.0-alt1.noarch.rpm: license not found in '/usr/share/license' directory: BSD-2-Clause
riscv64/rpms/gem-sync-0.5.0-alt1.noarch.rpm: license not found in '/usr/share/license' directory: BSD-2-Clause
riscv64/rpms/gem-sync-doc-0.5.0-alt1.noarch.rpm: license not found in '/usr/share/license' directory: BSD-2-Clause
gem-sync-devel-0.5.0-alt1.noarch.rpm: changelog name (majioa@) does not match expected name (alt_sisyphus@)
gem-sync-0.5.0-alt1.noarch.rpm: changelog name (majioa@) does not match expected name (alt_sisyphus@)
gem-sync-doc-0.5.0-alt1.noarch.rpm: changelog name (majioa@) does not match expected name (alt_sisyphus@)
gem-sync-0.5.0-alt1.src.rpm: changelog name (majioa@) does not match expected name (alt_sisyphus@)
2022-Jan-21 14:27:30 :: #24500: gem-sync-0.5.0-alt1.src.rpm: build check OK
riscv64/srpm/gem-tins-1.29.0-alt1.src.rpm: license not found in '/usr/share/license' directory: MIT
riscv64/rpms/gem-tins-devel-1.29.0-alt1.noarch.rpm: license not found in '/usr/share/license' directory: MIT
riscv64/rpms/gem-tins-doc-1.29.0-alt1.noarch.rpm: license not found in '/usr/share/license' directory: MIT
riscv64/rpms/gem-tins-1.29.0-alt1.noarch.rpm: license not found in '/usr/share/license' directory: MIT
gem-tins-devel-1.29.0-alt1.noarch.rpm: changelog name (majioa@) does not match expected name (alt_sisyphus@)
gem-tins-doc-1.29.0-alt1.noarch.rpm: changelog name (majioa@) does not match expected name (alt_sisyphus@)
gem-tins-1.29.0-alt1.noarch.rpm: changelog name (majioa@) does not match expected name (alt_sisyphus@)
gem-tins-1.29.0-alt1.src.rpm: changelog name (majioa@) does not match expected name (alt_sisyphus@)
2022-Jan-21 14:27:31 :: #24600: gem-tins-1.29.0-alt1.src.rpm: build check OK
riscv64/srpm/gem-progressbar-1.10.1-alt1.1.src.rpm: license not found in '/usr/share/license' directory: MIT
riscv64/rpms/gem-progressbar-1.10.1-alt1.1.noarch.rpm: license not found in '/usr/share/license' directory: MIT
riscv64/rpms/gem-ruby-progressbar-1.10.1-alt1.1.noarch.rpm: license not found in '/usr/share/license' directory: MIT
riscv64/rpms/gem-progressbar-doc-1.10.1-alt1.1.noarch.rpm: license not found in '/usr/share/license' directory: MIT
riscv64/rpms/gem-ruby-progressbar-doc-1.10.1-alt1.1.noarch.rpm: license not found in '/usr/share/license' directory: MIT
gem-progressbar-1.10.1-alt1.1.noarch.rpm: changelog name (majioa@) does not match expected name (incominger@)
gem-ruby-progressbar-1.10.1-alt1.1.noarch.rpm: changelog name (majioa@) does not match expected name (incominger@)
gem-progressbar-doc-1.10.1-alt1.1.noarch.rpm: changelog name (majioa@) does not match expected name (incominger@)
gem-ruby-progressbar-doc-1.10.1-alt1.1.noarch.rpm: changelog name (majioa@) does not match expected name (incominger@)
gem-progressbar-1.10.1-alt1.1.src.rpm: changelog name (majioa@) does not match expected name (incominger@)
2022-Jan-21 14:27:32 :: #24700: gem-progressbar-1.10.1-alt1.1.src.rpm: build check OK
gem-ruby-ldap-0.9.20-alt4.2.riscv64.rpm: changelog name (majioa@) does not match expected name (incominger@)
gem-ruby-ldap-doc-0.9.20-alt4.2.noarch.rpm: changelog name (majioa@) does not match expected name (incominger@)
gem-ruby-ldap-debuginfo-0.9.20-alt4.2.riscv64.rpm: changelog name (majioa@) does not match expected name (incominger@)
gem-ruby-ldap-0.9.20-alt4.2.src.rpm: changelog name (majioa@) does not match expected name (incominger@)
2022-Jan-21 14:27:33 :: #25000: gem-ruby-ldap-0.9.20-alt4.2.src.rpm: build check OK
riscv64/srpm/gem-activesupport-6.1.4.1-alt0.2.re.rv64.src.rpm: license not found in '/usr/share/license' directory: MIT
riscv64/rpms/gem-activesupport-6.1.4.1-alt0.2.re.rv64.noarch.rpm: license not found in '/usr/share/license' directory: MIT
2022-Jan-21 14:27:33 :: #25200: gem-activesupport-6.1.4.1-alt0.2.re.rv64.src.rpm: build check OK
riscv64/srpm/gem-rubygems-update-3.2.19-alt1.src.rpm: license not found in '/usr/share/license' directory: MIT
riscv64/srpm/gem-rubygems-update-3.2.19-alt1.src.rpm: license not found in '/usr/share/license' directory: Ruby
riscv64/rpms/gem-bundler-doc-2.2.19-alt1.noarch.rpm: license not found in '/usr/share/license' directory: MIT
riscv64/rpms/gem-bundler-doc-2.2.19-alt1.noarch.rpm: license not found in '/usr/share/license' directory: Ruby
riscv64/rpms/bundle-2.2.19-alt1.noarch.rpm: license not found in '/usr/share/license' directory: MIT
riscv64/rpms/bundle-2.2.19-alt1.noarch.rpm: license not found in '/usr/share/license' directory: Ruby
riscv64/rpms/gem-bundler-2.2.19-alt1.noarch.rpm: license not found in '/usr/share/license' directory: MIT
riscv64/rpms/gem-bundler-2.2.19-alt1.noarch.rpm: license not found in '/usr/share/license' directory: Ruby
riscv64/rpms/gem-rubygems-update-3.2.19-alt1.noarch.rpm: license not found in '/usr/share/license' directory: MIT
riscv64/rpms/gem-rubygems-update-3.2.19-alt1.noarch.rpm: license not found in '/usr/share/license' directory: Ruby
riscv64/rpms/update-rubygems-3.2.19-alt1.noarch.rpm: license not found in '/usr/share/license' directory: MIT
riscv64/rpms/update-rubygems-3.2.19-alt1.noarch.rpm: license not found in '/usr/share/license' directory: Ruby
gem-bundler-doc-2.2.19-alt1.noarch.rpm: changelog name (majioa@) does not match expected name (incominger@)
bundle-2.2.19-alt1.noarch.rpm: changelog name (majioa@) does not match expected name (incominger@)
gem-bundler-2.2.19-alt1.noarch.rpm: changelog name (majioa@) does not match expected name (incominger@)
gem-rubygems-update-3.2.19-alt1.noarch.rpm: changelog name (majioa@) does not match expected name (incominger@)
update-rubygems-3.2.19-alt1.noarch.rpm: changelog name (majioa@) does not match expected name (incominger@)
gem-rubygems-update-3.2.19-alt1.src.rpm: changelog name (majioa@) does not match expected name (incominger@)
2022-Jan-21 14:27:38 :: #25500: gem-rubygems-update-3.2.19-alt1.src.rpm: build check OK
find: 'riscv64/srpm/': No such file or directory
2022-Jan-21 14:27:38 :: build check FAILED for #25600
2022-Jan-21 14:27:39 :: build check FAILED
2022-Jan-21 14:27:39 :: task #15535 for sisyphus_riscv64 FAILED


More information about the Riscv-reports mailing list